program: Gaussian 09
title: 000207066
version: EM64L-G09RevD.01
frameworkgroup: C1[X(C20H14Cl2N2O3)]
method: RPBEPBE
basis: SDD
operation: Freq
keyword: #p
keyword: freq=noraman
keyword: PBEPBE/SDD
title: #p freq=noraman PBEPBE/SDD
converged: YES YES NO NO
title: Mulliken charges:
elementType: Cl Cl O O O N N C C C C C C C C C C C C C C C C C C C C H H H H H H H H H H H H H H
charge: -0.060572 -0.059695 -0.510066 -0.289399 -0.272771 -0.483361 -0.479249 0.066133 0.290542 -0.412750 0.258662 -0.336541 0.129712 0.123667 -0.393880 0.492760 0.509342 -0.328210 -0.442595 -0.327547 -0.443012 -0.198406 -0.182712 -0.198937 -0.183967 -0.120398 -0.120037 0.251303 0.286003 0.227131 0.388484 0.321536 0.314739 0.230255 0.314877 0.230939 0.254852 0.254195 0.255101 0.256336 0.387536
chargesum: 0.00000
title: Mulliken charges with hydrogens summed into heavy atoms:
elementType: Cl Cl O O O N N C C C C C C C C C C C C C C C C C C C C
charge: -0.060572 -0.059695 -0.122530 -0.289399 -0.272771 -0.094877 -0.157713 0.066133 0.290542 -0.161448 0.258662 -0.050538 0.129712 0.123667 -0.166749 0.492760 0.509342 -0.013471 -0.212341 -0.012670 -0.212073 0.056446 0.071483 0.056164 0.072370 -0.120398 -0.120037
polarizability: 5.08965074e+02 6.00420145e+00 3.12539128e+02 4.59537912e+00 -2.01120951e+00 9.63147483e+01
1716.lowfreq: -3.0611 0.0011 0.0017 0.0019 2.0043 3.6812 13.5689 20.4697 25.5893
frequency: 13.4937 20.4685 25.5838 32.2080 42.5357 68.4709 75.6605 76.7976 106.3856 126.7118 130.6442 155.0957 176.2087 183.4266 211.2011 232.7086 271.0466 300.6035 311.2264 336.7503 347.3716 348.3679 357.6489 359.9943 384.5513 395.9253 410.6086 412.0355 412.6176 431.0203 453.4890 502.9167 510.8416 537.0246 542.6658 602.3952 618.3182 626.6627 632.1195 637.7802 659.8344 664.7576 698.5588 705.3956 706.2573 738.9781 756.1018 795.4993 797.5260 809.3761 816.6130 830.3172 834.9696 837.4032 846.8425 847.7806 857.8259 921.9279 938.9343 941.3888 942.2518 982.9621 983.2364 986.1293 993.1342 993.4688 1064.9805 1072.4168 1073.1855 1091.3480 1112.1699 1116.7063 1124.6004 1161.3226 1183.5211 1185.2063 1214.1782 1228.8983 1258.4545 1260.7456 1279.1694 1295.0398 1296.9126 1307.2346 1366.5063 1369.6644 1396.6402 1401.1208 1401.5109 1404.9284 1474.8162 1480.1008 1482.7749 1516.5817 1540.4789 1576.5526 1580.1828 1596.1715 1601.0960 1605.4505 1607.6197 1618.1720 1637.2607 3119.1272 3121.1772 3121.5183 3127.2737 3165.4401 3166.4645 3169.0509 3172.5308 3173.5663 3198.0057 3199.0653 3382.4847 3538.8214 3598.3171
redmass: 4.6995 6.2959 12.0267 9.6297 4.9938 6.6102 8.3688 8.8448 6.8693 9.4066 6.0550 6.6152 10.0833 6.3242 9.8627 8.4141 7.9451 5.4760 6.5916 5.2838 3.0371 5.1369 1.8887 3.9879 6.4455 8.5979 10.0941 3.0195 3.0264 3.3521 8.4513 2.8508 2.7839 4.1975 4.3034 8.1639 7.2488 7.2532 6.9417 1.2952 7.0694 5.6355 7.4565 3.5104 3.5116 5.0256 3.4320 1.3031 6.9244 6.4223 1.3910 1.4696 1.4139 4.3631 1.4136 1.4528 6.9418 6.0699 1.4202 1.3632 1.4607 1.3188 1.3172 1.3515 4.2590 4.2800 2.8044 2.9359 2.5781 2.7351 1.4203 1.3647 1.8016 1.1583 1.1157 1.1142 2.6734 3.1848 2.7874 2.3419 1.8614 1.3501 1.4118 1.7014 5.2090 5.1431 5.0931 4.4308 8.0809 4.0239 2.4223 2.6000 2.7907 2.3779 3.1557 7.0426 7.9185 5.1504 4.8512 5.9032 4.9713 4.7756 2.8286 1.0904 1.0904 1.0905 1.0900 1.0914 1.0912 1.0946 1.0952 1.0952 1.0952 1.0952 1.0799 1.0757 1.0664
irintensity: 5.5321 0.8828 0.4070 0.1702 0.6217 4.9102 0.1876 2.6160 2.4933 3.3118 0.6666 0.0831 4.0251 0.6395 0.5140 1.7928 11.2032 6.7592 9.6408 1.8538 29.1555 10.3384 75.0496 21.5141 0.8231 23.5261 50.2815 0.1345 0.0715 1.0601 13.8534 3.9003 73.7511 7.0814 5.2653 8.2801 0.7643 1.8525 3.7724 34.4735 20.0263 16.5778 54.3868 0.4647 1.4985 26.6783 2.1325 4.8482 2.8378 14.0223 37.2081 0.9574 100.4936 12.7196 43.8039 121.5312 0.7302 18.4593 1.7638 1.9186 16.5648 2.1630 4.9193 1.3655 41.2363 31.2264 111.0521 47.1502 97.5701 20.4426 36.8913 24.2262 84.3062 1.8357 0.2015 1.2290 84.8032 50.8253 20.3525 94.0082 88.0338 60.9651 45.2028 35.8919 185.1255 61.9087 15.3985 11.4946 5.6561 38.0680 1.3878 173.6042 492.8288 340.3948 498.4709 69.5255 28.6911 59.6304 82.2323 3.5156 10.0204 144.2683 86.8746 23.1531 17.0151 7.0550 11.1124 2.7992 2.6265 4.1833 3.3128 2.0814 9.4842 9.2718 155.4597 14.8950 86.1454
temp: 298.150 k
press: 1.00000 atm
elementType: 17 17 8 8 8 7 7 6 6 6 6 6 6 6 6 6 6 6 6 6 6 6 6 6 6 6 6 1 1 1 1 1 1 1 1 1 1 1 1 1 1
symmnumber: 1
zpe: 774854.9 jmol-1
zpe.correction: 0.295127 hartree
zpe.thermalcorrener: 0.318742 hartree
zpe.thermalcorrenthalpy: 0.319686 hartree
zpe.thermalcorrgfe: 0.237893 hartree
zpe.sumelectzpe: -2023.998144 hartree
zpe.sumelectthermal: -2023.974529 hartree
zpe.sumelectthermalent: -2023.973584 hartree
zpe.sumelectthermalfe: -2024.055377 hartree
dipole: 3.3681 5.3753 0.6523
dipole: 6.3768
quadrupole: -209.6567 -144.8399 -177.0633
quadrupole: 25.4737 -0.1282 0.6413
quadrupole: -32.4700 32.3467 0.1234 25.4737 -0.1282 0.6413
hfenergy: -2024.2932702 hartree
pointgroup: C01 [X(C20H14Cl2N2O3)]
dipole: 1.3783073 2.0962218 -0.0171629 debye
polarizability: 505.6109352|0.2078732|311.2642309|-38.1932223|-15.653942|100.943784 unknown
InChI: InChI=1S/C20H14Cl2N2O3/c21-13-2-6-15(7-3-13)23-19(26)12-1-10-18(25)17(11-12)20(27)24-16-8-4-14(22)5-9-16/h1-11,23-25H
charge 0 multiplicity 1
41 atoms
Cl 8.144366 -3.094778 -0.780482
Cl -8.61225 -2.662668 0.968915
O  2.54291 3.00101 -0.440668
O  1.44368 -1.131584 -0.233415
O  -3.861958 2.392977 -0.030374
N  3.209187 0.403575 -0.439988
N  -3.283246 0.145116 0.308336
C  0.889315 1.221049 -0.254942
C  -1.512064 1.811143 -0.063522
C  -0.473667 0.85674 -0.130843
C  1.192669 2.61009 -0.316928
C  -1.172109 3.187681 -0.136233
C  1.869716 0.06717 -0.308738
C  -2.97909 1.483055 0.067368
C  0.168271 3.583893 -0.260295
C  4.325091 -0.470824 -0.513776
C  -4.563252 -0.45747 0.455716
C  4.221533 -1.888294 -0.460277
C  5.607739 0.130365 -0.648633
C  -5.783163 0.267805 0.371277
C  -4.596427 -1.858257 0.698798
C  5.386724 -2.680233 -0.54158
C  6.770528 -0.659986 -0.729974
C  -7.011298 -0.409563 0.527785
C  -5.822364 -2.533486 0.855796
C  6.643661 -2.062014 -0.67511
C  -7.019394 -1.796233 0.767318
H  -0.641173 -0.227509 -0.109183
H  -1.982943 3.921452 -0.096946
H  0.422272 4.650354 -0.31363
H  3.408032 1.413608 -0.486919
H  -2.494119 -0.496749 0.40509
H  3.23861 -2.349957 -0.356665
H  5.699021 1.222499 -0.69049
H  -5.757195 1.342751 0.187504
H  -3.661277 -2.428592 0.764763
H  5.309698 -3.770549 -0.500869
H  7.754284 -0.193824 -0.834064
H  -7.951938 0.144992 0.463037
H  -5.843614 -3.610701 1.042216
H  2.640939 3.983148 -0.480374
