program: Gaussian 09
title: 000207062
version: EM64L-G09RevD.01
frameworkgroup: C1[X(C20H12Br4N2O3)]
method: RPBEPBE
basis: SDD
operation: Freq
keyword: #p
keyword: freq=noraman
keyword: PBEPBE/SDD
title: #p freq=noraman PBEPBE/SDD
converged: YES YES NO NO
title: Mulliken charges:
elementType: Br Br Br Br O O O N N C C C C C C C C C C C C C C C C C C C C H H H H H H H H H H H H
charge: 0.028979 0.030889 0.026700 0.023652 -0.387029 -0.211476 -0.258899 -0.467670 -0.476050 0.139964 0.297384 -0.462021 0.149617 -0.332405 0.115101 0.106867 -0.384996 0.646643 0.658116 -0.481618 -0.241949 -0.500249 -0.245010 -0.216318 -0.169282 -0.211351 -0.164009 -0.233296 -0.237717 0.243832 0.282371 0.232654 0.319682 0.301515 0.336985 0.338009 0.256171 0.254705 0.261251 0.261043 0.369214
chargesum: 0.00000
title: Mulliken charges with hydrogens summed into heavy atoms:
elementType: Br Br Br Br O O O N N C C C C C C C C C C C C C C C C C C C C
charge: 0.028979 0.030889 0.026700 0.023652 -0.017815 -0.211476 -0.258899 -0.147989 -0.174534 0.139964 0.297384 -0.218189 0.149617 -0.050034 0.115101 0.106867 -0.152341 0.646643 0.658116 -0.481618 0.095036 -0.500249 0.092999 -0.216318 0.086890 -0.211351 0.090696 0.027954 0.023326
polarizability: 4.98169245e+02 3.39351051e+00 3.52575270e+02 2.20258899e+01 -2.06079216e+00 1.70437177e+02
1716.lowfreq: -2.8567 -1.4804 -0.0004 0.0004 0.0006 1.9277 7.8355 11.1397 16.1239
frequency: 7.7007 11.1210 16.1093 31.4912 39.4885 45.2625 69.2158 70.3467 73.5695 85.4215 89.0181 105.2831 110.5103 131.7286 138.6898 172.8339 201.7581 202.0246 208.4610 226.3751 234.5344 249.8303 264.9579 282.5419 292.6929 300.4483 322.8410 364.6856 372.2460 376.1618 381.2204 406.9973 435.1443 440.9226 445.8448 447.4024 470.9309 476.0822 528.6085 572.9433 577.2919 580.8056 604.0686 630.4259 659.9677 671.6971 679.5333 681.0585 688.2653 712.4317 721.7613 725.9642 749.9988 766.8176 799.1870 799.5082 801.2174 835.2540 836.8356 874.0534 875.9492 915.5765 923.7969 927.3639 932.1400 944.8986 946.4745 979.5432 991.0823 992.6624 1054.5848 1074.8755 1077.2413 1090.7039 1111.6545 1137.5723 1139.7519 1163.1810 1219.4711 1238.1542 1238.8604 1258.3834 1263.8300 1267.2054 1278.5257 1309.0559 1356.6240 1360.9818 1384.8343 1397.4662 1400.8842 1405.7903 1428.1857 1432.8139 1487.6375 1495.2607 1507.3743 1559.3408 1561.8840 1580.5968 1591.6172 1592.8519 1602.9769 1611.3663 1623.6972 3115.8202 3127.3858 3165.3285 3165.6231 3168.8950 3185.5721 3185.9273 3187.9873 3188.8596 3475.3039 3482.8863 3574.3088
redmass: 32.0124 28.8883 17.8738 10.8203 12.2942 8.7075 8.0839 7.9948 17.3302 7.7771 7.0194 10.7252 8.8786 12.3358 6.4155 7.8757 61.2873 64.3602 6.2968 6.8605 6.5141 7.5336 9.0530 6.8967 8.6183 5.5280 6.3448 7.1470 5.0890 5.4715 1.2501 7.3467 5.1077 4.6149 3.2925 3.6927 5.3434 4.6869 4.8917 5.2972 5.1568 4.4742 5.6714 7.5080 3.3592 1.5605 5.1784 4.5693 1.9720 5.8139 3.6293 3.0309 6.0453 4.1270 1.3267 1.3393 6.3578 1.6508 5.9299 5.0745 6.8465 1.9806 3.9946 1.3897 1.3717 1.3533 1.3575 1.3644 7.2064 7.2901 3.3498 2.2707 1.9173 2.5481 1.9255 1.4461 1.4606 1.1564 2.4651 1.6931 1.7131 1.9729 2.1512 1.7324 2.4999 1.4308 5.9541 6.8373 4.9807 4.1196 3.9381 5.8742 2.4314 2.5717 2.6006 2.6527 2.7878 5.2451 5.2352 5.4886 7.3931 7.6148 5.8997 5.3367 6.2591 1.0909 1.0901 1.0891 1.0891 1.0949 1.0970 1.0964 1.0943 1.0936 1.0766 1.0758 1.0663
irintensity: 0.0851 0.0226 0.1054 0.5098 1.3250 1.6817 0.5937 0.0586 1.7804 4.6579 1.9081 2.9254 1.3930 2.7152 1.0771 0.6195 0.0815 0.0309 0.7412 1.9622 1.0248 0.4487 3.8717 3.8645 19.1995 5.3476 2.6525 3.0997 17.3345 14.6435 126.3946 5.4817 5.1562 5.9900 31.6031 7.5878 3.4728 2.1369 20.0571 12.0802 7.2901 7.2433 2.7467 13.5504 20.3547 15.6707 19.7825 9.2633 60.0026 29.3100 9.0522 26.1030 7.6381 10.5661 35.4118 42.7751 9.7652 23.4090 28.7893 22.0862 103.2942 4.5796 20.3596 20.0229 22.3803 4.0523 8.7059 4.2038 172.9440 36.0170 78.3949 38.8083 43.7087 61.1781 239.3374 14.0755 10.6177 8.4732 218.7134 13.4255 17.3780 32.1857 36.6544 23.8231 225.1450 40.1459 52.4970 209.0660 41.6692 45.8872 148.7695 15.1701 41.9162 46.2308 541.4572 390.3264 229.8484 59.4886 70.6643 0.7293 127.2168 210.2229 33.4499 160.8891 119.4312 8.7382 13.0071 0.6387 0.5361 3.1325 0.0375 0.3986 22.5340 24.7131 39.9786 49.1422 82.5626
temp: 298.150 k
press: 1.00000 atm
elementType: 35 35 35 35 8 8 8 7 7 6 6 6 6 6 6 6 6 6 6 6 6 6 6 6 6 6 6 6 6 1 1 1 1 1 1 1 1 1 1 1 1
symmnumber: 1
zpe: 716911.3 jmol-1
zpe.correction: 0.273057 hartree
zpe.thermalcorrener: 0.300477 hartree
zpe.thermalcorrenthalpy: 0.301421 hartree
zpe.thermalcorrgfe: 0.208064 hartree
zpe.sumelectzpe: -1156.359563 hartree
zpe.sumelectthermal: -1156.332143 hartree
zpe.sumelectthermalent: -1156.331199 hartree
zpe.sumelectthermalfe: -1156.424556 hartree
dipole: -0.5771 -0.8620 3.2941
dipole: 3.4535
quadrupole: -233.9069 -171.4737 -209.3632
quadrupole: -3.0684 -6.8868 12.4954
quadrupole: -28.9923 33.4409 -4.4486 -3.0684 -6.8868 12.4954
hfenergy: -1156.63262 hartree
pointgroup: C01 [X(C20H12Br4N2O3)]
dipole: 0.232215 -0.2363556 -1.3177062 debye
polarizability: 496.2370732|-14.5325298|351.9816317|27.4229128|16.5474541|172.9629877 unknown
InChI: InChI=1S/C20H12Br4N2O3/c21-11-2-4-14(23)16(8-11)25-19(28)10-1-6-18(27)13(7-10)20(29)26-17-9-12(22)3-5-15(17)24/h1-9,25-27H
charge 0 multiplicity 1
41 atoms
Br 1.950975 -2.379534 -2.208272
Br -1.848909 -2.799086 -0.506258
Br 7.116381 -1.645378 2.016509
Br -7.9247 -0.318822 0.912532
O  2.573896 4.027732 -0.541531
O  3.361853 1.72336 1.146154
O  -3.613913 2.330236 0.161505
N  2.601433 0.082654 -0.363085
N  -2.651911 0.20028 -0.080205
C  1.256602 2.081121 -0.034309
C  -1.213161 2.187024 -0.121417
C  -0.009923 1.462737 0.080284
C  1.314457 3.463888 -0.371533
C  -1.128567 3.570278 -0.423586
C  2.511271 1.312842 0.30888
C  -2.589289 1.597162 0.005457
C  0.117895 4.201736 -0.555704
C  3.574605 -0.930624 -0.20992
C  -3.778706 -0.637663 0.06473
C  3.461208 -2.135202 -0.964224
C  4.68086 -0.800934 0.678246
C  -3.62361 -2.047593 -0.085394
C  -5.079213 -0.137832 0.361529
C  5.608216 -1.850886 0.782523
C  4.401502 -3.172329 -0.85048
C  -6.148165 -1.038083 0.502159
C  -4.704891 -2.932021 0.057691
C  5.495576 -3.040095 0.034528
C  -5.99257 -2.43133 0.357147
H  -0.033932 0.414485 0.40525
H  -2.061353 4.129116 -0.546636
H  0.167377 5.268095 -0.808981
H  1.891307 -0.097632 -1.080897
H  -1.784218 -0.295808 -0.30519
H  4.779487 0.120448 1.254523
H  -5.208858 0.940589 0.465645
H  4.28725 -4.0836 -1.443621
H  -4.553062 -4.008105 -0.061986
H  6.229764 -3.843666 0.128932
H  -6.838525 -3.113503 0.469722
H  2.517462 4.998441 -0.727217
