program: Gaussian 09
title: 000207060
version: EM64L-G09RevD.01
frameworkgroup: C1[X(C20H14Br2N2O3)]
method: RPBEPBE
basis: SDD
operation: Freq
keyword: #p
keyword: freq=noraman
keyword: PBEPBE/SDD
title: #p freq=noraman PBEPBE/SDD
converged: YES YES NO NO
title: Mulliken charges:
elementType: Br Br O O O N N C C C C C C C C C C C C C C C C C C C C H H H H H H H H H H H H H H
charge: -0.001721 0.004873 -0.510382 -0.284982 -0.271016 -0.489661 -0.484685 0.064580 0.289550 -0.406941 0.260927 -0.335022 0.131644 0.126811 -0.394595 0.497723 0.512181 -0.410648 -0.350336 -0.411047 -0.349347 -0.154405 -0.197551 -0.158014 -0.198957 -0.227493 -0.225837 0.249942 0.286354 0.227984 0.394022 0.324898 0.247853 0.314327 0.248388 0.314719 0.234969 0.234908 0.253448 0.253575 0.388965
chargesum: 0.00000
title: Mulliken charges with hydrogens summed into heavy atoms:
elementType: Br Br O O O N N C C C C C C C C C C C C C C C C C C C C
charge: -0.001721 0.004873 -0.121417 -0.284982 -0.271016 -0.095639 -0.159787 0.064580 0.289550 -0.157000 0.260927 -0.048668 0.131644 0.126811 -0.166611 0.497723 0.512181 -0.162795 -0.036009 -0.162660 -0.034627 -0.154405 0.037419 -0.158014 0.035951 0.025955 0.027737
polarizability: 5.02563678e+02 -3.85044987e+00 3.40384665e+02 2.54065982e+00 -5.74964866e-01 9.72876944e+01
1716.lowfreq: -1.3275 0.0004 0.0006 0.0009 1.3688 2.0550 3.6580 14.5316 22.6492
frequency: 1.6691 14.4396 22.6484 41.6276 43.8218 56.7069 59.9112 85.2323 108.9857 116.5986 149.7934 168.2251 169.6405 171.1354 184.7094 210.7523 238.8504 259.0190 265.2511 292.5517 294.0202 315.4697 327.0199 361.7449 378.8228 385.5511 392.0677 424.3011 431.7756 437.4953 441.7834 526.7101 531.9778 552.3479 558.4968 567.3041 587.3143 635.5148 646.2381 646.8739 659.7767 666.0301 687.2380 687.7414 701.9566 739.6533 757.6894 793.0654 793.5964 805.3096 814.2622 831.6651 842.2897 852.3557 856.3467 871.1606 879.5379 920.4805 920.5491 927.5437 941.5669 976.0818 976.1594 988.1621 996.9345 997.0499 1063.1026 1065.1071 1069.3734 1093.3246 1097.6378 1101.7606 1123.8766 1160.9168 1178.6126 1179.5256 1214.4446 1227.6036 1251.9060 1258.8035 1269.5287 1296.0618 1307.7664 1316.8781 1369.2896 1370.7591 1396.0718 1401.6620 1406.0197 1415.0342 1468.2612 1470.0037 1480.3268 1518.7040 1540.2675 1572.7362 1575.8632 1586.0328 1597.0379 1607.0630 1609.7692 1619.6246 1639.0909 3120.5140 3123.2835 3140.2605 3146.0091 3146.8092 3147.6330 3169.6885 3177.7584 3179.6360 3202.1426 3203.1387 3377.8099 3540.7289 3599.4178
redmass: 6.6348 10.2725 15.9375 6.0410 5.8876 12.4355 7.3932 6.9923 10.8812 6.5990 5.4221 5.2834 8.9629 5.0455 8.2582 8.5028 4.1853 7.9889 4.4812 7.0554 8.4937 7.4478 4.3449 1.2112 8.9333 6.6913 6.2047 3.1925 8.2652 3.0666 3.1797 4.3066 5.1333 7.9826 3.8404 4.7502 5.9236 7.4018 1.4959 6.1540 7.6018 4.7830 2.2728 2.2642 8.1382 4.9711 3.6016 1.3350 1.3278 7.3750 1.2309 1.5668 7.7097 6.2783 6.4812 1.5812 1.5078 1.3730 1.3712 6.1201 1.5303 5.8928 5.8975 1.3520 1.3151 1.3164 2.7478 2.4384 2.1846 2.0576 1.5479 1.8583 1.9900 1.1573 1.0877 1.0873 2.6371 2.8991 1.8822 3.1248 1.7273 1.3036 1.6147 1.7670 5.0131 5.1899 4.9379 7.9327 3.5376 3.4666 2.6048 2.6639 2.7594 2.3988 3.2746 8.8354 8.5147 4.1035 3.9890 6.1483 5.4143 4.6769 2.6790 1.0904 1.0902 1.0925 1.0894 1.0890 1.0919 1.0946 1.0957 1.0954 1.0953 1.0952 1.0801 1.0756 1.0664
irintensity: 1.8902 0.0006 0.0649 3.1558 2.9304 0.6697 5.5766 0.5101 3.7565 1.5465 0.7710 0.7750 0.4820 1.8297 1.8968 9.4617 2.0673 6.6441 2.3016 5.3444 1.0112 16.1213 10.1548 130.1975 1.7106 4.5703 0.5486 3.2170 3.3577 3.0847 11.7341 7.1749 2.2404 78.4360 9.2056 1.4140 16.8501 14.7747 32.4852 22.8598 11.0477 29.6799 5.7502 37.9749 5.7824 29.4229 1.8343 66.2255 56.3501 11.6022 30.3717 40.4356 11.5285 64.1448 9.6365 34.2834 79.1352 1.4358 10.3088 0.6740 17.8747 28.4377 8.7113 0.6697 3.9035 4.5980 12.3352 27.9778 131.2327 60.0283 61.4330 5.8718 117.7385 0.8338 0.0333 0.8209 107.2086 73.9591 11.6531 122.7946 39.6328 75.2106 141.0829 29.6731 168.7982 50.4217 19.6136 7.2696 48.5300 70.3427 233.1473 83.6072 252.4042 223.8867 287.2789 238.3520 165.0685 201.7693 277.6505 51.3507 25.2204 104.9692 75.5321 21.5941 13.6594 6.8770 12.3126 9.8304 1.9130 4.4230 4.4087 4.3014 9.4851 10.3677 153.6492 14.9739 88.5859
temp: 298.150 k
press: 1.00000 atm
elementType: 35 35 8 8 8 7 7 6 6 6 6 6 6 6 6 6 6 6 6 6 6 6 6 6 6 6 6 1 1 1 1 1 1 1 1 1 1 1 1 1 1
symmnumber: 1
zpe: 772687.6 jmol-1
zpe.correction: 0.294301 hartree
zpe.thermalcorrener: 0.318377 hartree
zpe.thermalcorrenthalpy: 0.319321 hartree
zpe.thermalcorrgfe: 0.233513 hartree
zpe.sumelectzpe: -1130.796441 hartree
zpe.sumelectthermal: -1130.772365 hartree
zpe.sumelectthermalent: -1130.771421 hartree
zpe.sumelectthermalfe: -1130.857229 hartree
dipole: -2.1954 4.0472 -0.1855
dipole: 4.6080
quadrupole: -188.8740 -153.7207 -183.1679
quadrupole: -11.2071 0.3203 -0.7589
quadrupole: -13.6198 21.5335 -7.9137 -11.2071 0.3203 -0.7589
hfenergy: -1131.090742 hartree
pointgroup: C01 [X(C20H14Br2N2O3)]
dipole: 0.54198 0.8619712 -1.4999949 debye
polarizability: 493.3025438|40.5760957|150.5627074|-17.2902811|-100.4917188|296.370787 unknown
InChI: InChI=1S/C20H14Br2N2O3/c21-13-3-1-5-15(10-13)23-19(26)12-7-8-18(25)17(9-12)20(27)24-16-6-2-4-14(22)11-16/h1-11,23-25H
charge 0 multiplicity 1
41 atoms
Br 8.576091 0.743763 -0.082086
Br -5.746439 -2.360446 4.098498
O  2.533574 1.557715 -2.583809
O  1.548055 -0.441364 1.069231
O  -3.841875 0.752001 -2.130707
N  3.27328 0.403809 -0.283452
N  -3.244764 -0.158176 -0.052822
C  0.927703 0.606859 -1.01845
C  -1.492039 0.700724 -1.554436
C  -0.426027 0.334101 -0.704084
C  1.193556 1.275309 -2.246466
C  -1.187868 1.364862 -2.771978
C  1.941174 0.14531 0.009419
C  -2.952429 0.437074 -1.279115
C  0.142224 1.650261 -3.115215
C  4.415248 0.092102 0.499069
C  -4.515313 -0.530837 0.465715
C  5.675995 0.476902 -0.040573
C  4.358727 -0.564361 1.75893
C  -4.526951 -1.135594 1.754295
C  -5.736971 -0.329689 -0.232076
C  6.846645 0.20225 0.684005
C  5.557976 -0.821336 2.455168
C  -5.752663 -1.525064 2.318711
C  -6.946179 -0.734895 0.369942
C  6.818851 -0.445491 1.935774
C  -6.978895 -1.336632 1.649359
H  -0.558581 -0.189489 0.251163
H  -2.018535 1.641773 -3.428236
H  0.367014 2.164755 -4.058174
H  3.441742 0.885176 -1.179212
H  -2.45458 -0.355356 0.56416
H  5.731324 0.982041 -1.010562
H  3.39028 -0.85798 2.165501
H  -3.591754 -1.298088 2.30169
H  -5.719653 0.132867 -1.219446
H  5.513189 -1.326433 3.42596
H  -7.887367 -0.579381 -0.16809
H  7.741429 -0.649991 2.484907
H  -7.922394 -1.64598 2.106144
H  2.608701 2.017431 -3.454855
