program: Gaussian 09
title: 000016777
version: EM64L-G09RevD.01
frameworkgroup: C1[X(C9H16O)]
method: RPBEPBE
basis: SDD
operation: Freq
keyword: #pfreq=noraman
keyword: PBEPBE/SDD
title: #p freq=noraman PBEPBE/SDD
converged: YES YES NO NO
title: Mulliken charges:
elementType: O C C C C C C C C C H H H H H H H H H H H H H H H H
charge: -0.195303 -0.346519 -0.448045 -0.347075 -0.191318 -0.450784 -0.693381 -0.197850 -0.433797 -0.059487 0.202735 0.190281 0.195945 0.202189 0.195777 0.193733 0.227281 0.223930 0.224091 0.210079 0.216330 0.210178 0.223519 0.245311 0.230919 0.171261
chargesum: 0.00000
title: Mulliken charges with hydrogens summed into heavy atoms:
elementType: O C C C C C C C C C
charge: -0.195303 0.046498 -0.049911 0.042435 0.035962 -0.002764 -0.056793 0.025669 0.042433 0.111774
polarizability: 1.40802878e+02 4.53469572e-01 8.31560371e+01 2.95257653e+00 3.63536398e+00 8.34868599e+01
1716.lowfreq: -12.2615 -7.3682 0.0005 0.0008 0.0009 6.3727 29.8420 32.6691 59.9217
frequency: 29.6572 32.6264 59.8616 81.0764 93.2323 120.9064 155.3996 174.7991 194.8789 234.1115 254.7016 315.6625 386.3209 424.7547 510.3162 661.4560 679.3833 726.8600 776.2455 799.3930 842.3351 889.1601 899.5042 915.2681 968.3755 987.0093 1009.0005 1041.6814 1065.3323 1070.9635 1097.5014 1106.6394 1131.0975 1175.8814 1208.0697 1237.6799 1253.9116 1259.6454 1268.0085 1284.0300 1298.8316 1301.5575 1326.4560 1346.1503 1350.5041 1376.2498 1388.6337 1423.3044 1457.5411 1461.0585 1465.6299 1476.2681 1477.8610 1486.7414 1644.1690 1686.8832 2852.4122 2951.6691 2954.5896 2961.2834 2970.2481 2972.7256 2985.9347 2996.3131 2999.4513 3013.8955 3039.0253 3048.0944 3062.4857 3069.5991 3071.8997 3072.7565
redmass: 4.1479 3.9248 1.7413 2.9555 2.7660 2.4096 1.9728 2.2852 2.7659 1.1643 2.5143 3.9492 2.7858 2.7505 2.7842 1.2139 3.6093 1.0850 1.3023 1.5421 1.4924 1.8319 2.2978 1.4172 1.2346 1.4929 3.5173 1.4313 2.8839 2.5271 2.6587 2.0851 1.6900 1.6618 1.4418 1.3147 1.3551 1.1442 1.2061 1.0878 1.2323 1.2932 1.4477 1.5815 1.6147 1.2131 1.2146 1.0895 1.0846 1.0899 1.0729 1.0713 1.0425 1.0797 7.5800 6.5953 1.0840 1.0613 1.0625 1.0589 1.0603 1.0362 1.0667 1.0905 1.0964 1.0995 1.1032 1.0952 1.0961 1.1001 1.0993 1.0896
irintensity: 0.3251 7.3200 0.4876 1.5337 0.2157 1.8588 2.7706 2.6584 2.5610 0.0525 1.6605 7.2235 0.4322 3.4377 0.8601 9.5823 5.3465 8.9409 0.4174 1.1401 3.7515 7.2214 7.9810 3.9702 28.7274 27.9146 1.3441 11.1249 3.1128 1.3395 8.9548 4.1152 1.5337 0.3886 0.9399 4.6279 12.6365 0.7756 2.2286 0.5459 0.2720 10.1652 9.9182 0.3965 6.8820 5.2524 11.4607 36.9355 2.6837 17.3725 0.5808 5.2302 12.5161 17.1430 138.1065 0.0673 165.5900 23.9725 30.6055 0.4127 87.7681 42.1915 15.1293 12.1213 4.6971 1.1652 49.0728 4.9668 2.7097 57.0593 57.8108 112.7611
temp: 298.150 k
press: 1.00000 atm
elementType: 8 6 6 6 6 6 6 6 6 6 1 1 1 1 1 1 1 1 1 1 1 1 1 1 1 1
symmnumber: 1
zpe: 594621.5 jmol-1
zpe.correction: 0.226479 hartree
zpe.thermalcorrener: 0.239343 hartree
zpe.thermalcorrenthalpy: 0.240288 hartree
zpe.thermalcorrgfe: 0.185130 hartree
zpe.sumelectzpe: -426.935368 hartree
zpe.sumelectthermal: -426.922504 hartree
zpe.sumelectthermalent: -426.921560 hartree
zpe.sumelectthermalfe: -426.976717 hartree
dipole: -2.3336 1.5008 1.5824
dipole: 3.1941
quadrupole: -78.6290 -62.2148 -61.0115
quadrupole: 7.0340 8.2103 0.4507
quadrupole: -11.3439 5.0703 6.2736 7.0340 8.2103 0.4507
hfenergy: -427.1618473 hartree
pointgroup: C01 [X(C9H16O1)]
dipole: -0.9148666 -0.5941544 -0.6238388 debye
dipolederiv: -0.7561293 -0.0472552 -0.1474591 -0.1568928 -0.4975864 -0.1741408 -0.2646814 -0.1395487 -0.4474869 -0.0394088 -0.0195563 -0.0160302 0.0681695 0.0745027 0.0264733 -0.1140163 0.0371386 0.170505 -0.1240236 -0.0523817 -0.0216925 -0.0755329 0.1521033 0.0460356 0.0366492 0.0176811 0.1220461 0.0639257 -0.0293575 -0.0125991 -0.1096548 0.0985069 0.0383248 0.0369268 0.0379956 0.1539298 0.1546677 -0.0118395 0.0007004 -0.1205167 -0.2746894 -0.0140501 0.1184267 -0.0087882 0.1177143 -0.0444065 0.0397358 -0.0364232 0.0380006 0.1264592 -0.0325288 0.0472831 -0.0192384 0.075102 -0.0627535 -0.0754816 0.0156793 -0.0374819 0.0213281 0.0207431 -0.01481 0.0191193 0.0877747 0.1351778 -0.0746392 0.0060254 0.0156535 -0.2716444 -0.0520421 0.120389 -0.0760023 0.1140964 -0.5569482 0.0526804 -0.1535471 -0.068134 0.0533649 -0.0677753 -0.3201642 -0.0478378 0.082062 1.123154 -0.0559069 0.2685325 -0.0304294 0.6179437 0.3265014 0.3490781 0.3218469 0.3509109 0.0210477 0.066905 0.025115 0.0581318 -0.1289066 -0.0648315 0.0319432 -0.0882674 0.0298793 0.0498698 -0.0068657 -0.0180837 0.0010246 0.0520864 0.0314426 -0.0202286 0.0583502 -0.1872486 -0.0579048 0.1069024 0.042231 0.095692 -0.098448 -0.0616591 0.0123095 -0.0899294 0.0510479 0.0361479 -0.0138766 0.0181725 -0.0217262 0.0581053 0.0144024 -0.033387 0.0578911 -0.1692617 0.0347911 -0.0206872 0.0192658 -0.0065951 0.0499585 0.0522789 -0.0283179 0.0674098 -0.194496 0.0067087 0.0423452 0.0196103 0.078674 -0.1568432 -0.0774278 0.0382609 -0.1026342 0.0349734 0.023584 0.011955 -0.0379754 0.0367799 0.1500262 0.0315866 -0.0644081 0.0249612 -0.1317347 -0.0458549 -0.0945188 0.0355358 -0.0627873 -0.0500526 0.0350193 0.0185577 0.0459781 0.0795602 0.0602879 0.0127991 0.0316531 0.0348199 0.0625565 0.0129944 -0.0205314 -0.0014605 -0.1326723 0.0965188 -0.0067544 -0.0260778 -0.0236449 0.0615722 0.0244017 0.0305309 0.0631328 -0.1823951 -0.2304321 -0.0084217 -0.0601105 0.0118085 0.070152 0.0212692 -0.0786655 0.0135368 0.0760311 0.0664539 0.0940751 0.0532915 0.0288557 -0.1247171 -0.0784625 0.0426427 -0.1006425 0.0369018 0.0204988 0.0226524 -0.0380898 0.0005918 0.1524314 0.0232433 -0.0572111 0.0356673 -0.138955 0.0619483 -0.0697564 0.0080613 -0.0014613 -0.0830787 0.0419749 0.059351 0.0535705 0.0989223 0.0906278 0.0089702 -0.0023826 0.0530122 0.0938991 0.0127687 0.0297137 -0.0379946 -0.1143317 -0.1275482 0.1282782 0.0265972 0.1936432 -0.2090301 -0.1365423 0.0443592 -0.1419353 0.0171248 unknown
polarizability: 140.7604975|0.3458126|83.0621946|-3.3937635|3.589635|83.6230833 unknown
InChI: InChI=1S/C9H16O/c1-2-3-4-5-6-7-8-9-10/h5-6,9H,2-4,7-8H2,1H3
charge 0 multiplicity 1
26 atoms
O  4.883756 -0.057234 0.555737
C  -2.775384 -0.220705 0.245944
C  -1.854357 0.966625 -0.146269
C  -4.244032 -0.009847 -0.186677
C  -0.432393 0.798108 0.345013
C  2.093865 0.586483 0.053109
C  -5.159096 -1.192573 0.196993
C  0.673908 0.75933 -0.443353
C  2.7652 -0.675567 -0.535415
C  4.224212 -0.851787 -0.156515
H  -2.381751 -1.151827 -0.209317
H  -2.734354 -0.368563 1.345154
H  -2.288114 1.896113 0.281071
H  -1.860515 1.091855 -1.247244
H  -4.281662 0.148481 -1.283831
H  -4.628572 0.922793 0.274755
H  -0.307964 0.693471 1.435697
H  2.711206 1.465618 -0.219561
H  2.112736 0.53089 1.156911
H  -5.162109 -1.352229 1.291847
H  -6.203082 -1.017436 -0.121743
H  -4.813777 -2.130798 -0.276767
H  0.54982 0.864353 -1.534229
H  2.220974 -1.594128 -0.227451
H  2.710116 -0.675581 -1.646511
H  4.705471 -1.778145 -0.568847
