program: Gaussian 09
title: 000207059
version: EM64L-G09RevD.01
frameworkgroup: C1[X(C22H20N2O5)]
method: RPBEPBE
basis: SDD
operation: Freq
keyword: #p
keyword: freq=noraman
keyword: PBEPBE/SDD
title: #p freq=noraman PBEPBE/SDD
converged: YES YES NO NO
title: Mulliken charges:
elementType: O O O O O N N C C C C C C C C C C C C C C C C C C C C C C H H H H H H H H H H H H H H H H H H H H
charge: -0.510585 -0.295423 -0.283465 -0.263016 -0.265178 -0.481387 -0.475516 0.065930 0.290447 -0.416536 0.254190 -0.342237 0.121980 0.116974 -0.397405 0.483021 0.493933 -0.467625 -0.323459 -0.438670 -0.347982 0.321594 -0.323920 -0.351493 0.318216 -0.331537 -0.342050 -0.538240 -0.537936 0.251569 0.284297 0.222865 0.386127 0.319194 0.221241 0.311650 0.226439 0.307907 0.239233 0.250100 0.251571 0.240378 0.383569 0.245683 0.219240 0.219157 0.221450 0.244085 0.221621
chargesum: 0.00000
title: Mulliken charges with hydrogens summed into heavy atoms:
elementType: O O O O O N N C C C C C C C C C C C C C C C C C C C C C C
charge: -0.127015 -0.295423 -0.283465 -0.263016 -0.265178 -0.095260 -0.156323 0.065930 0.290447 -0.164967 0.254190 -0.057940 0.121980 0.116974 -0.174540 0.483021 0.493933 -0.246384 -0.011809 -0.212231 -0.040075 0.321594 -0.084687 -0.101393 0.318216 -0.079966 -0.101672 0.145839 0.149221
polarizability: 5.62337198e+02 -7.35130946e+00 3.20035763e+02 4.18029881e+00 1.18254558e+00 1.14377877e+02
1716.lowfreq: -2.9835 -0.0010 -0.0006 0.0001 2.3315 3.8912 12.7106 19.8279 26.7048
frequency: 12.6278 19.8017 26.6937 31.7616 43.1691 64.9766 69.9049 76.2854 90.4934 108.7825 118.4388 120.8772 141.4467 174.4207 184.9172 194.5757 200.0246 234.1636 240.1088 245.5521 251.6196 301.3167 313.2159 334.4081 346.9202 358.1578 374.9086 376.5570 382.4908 415.8228 416.5299 418.2721 433.5031 434.4183 455.3630 518.4181 521.7861 523.6783 527.0184 540.5458 552.0210 622.7935 627.7755 635.9667 636.7602 659.4268 663.5798 723.6114 725.1798 729.7885 735.4942 746.0131 753.1086 788.0824 799.7412 815.6060 818.3840 822.3670 829.0735 835.4571 842.6891 852.4735 860.0757 922.0178 923.6274 939.5082 944.1070 974.3161 983.4327 987.5699 987.6939 987.9746 999.3394 1000.7031 1064.2825 1092.9708 1112.7094 1112.8516 1115.0778 1117.8308 1124.6302 1158.1101 1159.0764 1159.4803 1178.9919 1181.3306 1213.4698 1219.2165 1224.5222 1232.0594 1258.7411 1261.2124 1282.9804 1300.4768 1307.6796 1310.8427 1373.6729 1374.6849 1396.6422 1400.7135 1421.4388 1426.9393 1437.0869 1437.7763 1466.2809 1468.0275 1473.1245 1473.7695 1477.9671 1502.0891 1502.9796 1519.2113 1543.6641 1574.0682 1576.0752 1595.4002 1601.5779 1614.7581 1628.0082 1628.5287 1635.2123 2955.7348 2957.9017 3041.9511 3045.1950 3115.6080 3115.6582 3118.3615 3119.8598 3123.9379 3124.0845 3158.3887 3161.7315 3164.3786 3167.9690 3170.5634 3195.3541 3196.9746 3389.6609 3538.7922 3597.8517
redmass: 4.2038 4.5702 6.2871 6.1314 4.4275 4.9555 5.4715 6.0302 3.9036 4.4601 5.4956 5.1865 4.9749 3.5757 6.9003 3.3397 4.1616 5.7998 1.4854 2.5733 1.2947 5.3691 3.8836 6.8805 1.2548 7.0034 5.5789 6.2593 5.1832 3.0531 3.1000 7.8327 4.2723 4.0233 4.8630 2.9520 4.7149 5.1164 2.4354 3.4720 4.4609 7.5040 7.0688 3.2054 1.6459 6.3859 6.1286 3.7325 3.6527 5.6168 5.0245 5.8378 3.4676 1.3257 7.0634 1.2915 6.6560 1.2601 1.5341 1.6276 5.9107 1.5039 6.8812 6.0613 1.3870 1.5030 1.3836 1.3151 1.3492 8.1588 8.3684 1.3156 2.7274 2.7241 2.6866 2.9517 1.2602 1.2602 1.4722 1.3574 1.7401 1.3115 1.3058 1.1929 1.2245 1.2315 2.5782 2.4880 2.7263 3.4929 2.0533 3.9206 2.0223 1.3574 1.4944 1.6989 5.4465 5.8951 5.0122 7.8181 4.1948 3.9845 1.1759 1.1761 1.0503 1.0500 1.1242 1.0811 2.4069 2.5642 2.5394 2.3511 3.1182 6.9799 7.3763 5.0888 3.9002 5.1443 5.2704 6.1073 3.1141 1.0332 1.0330 1.1038 1.1039 1.0903 1.0902 1.0895 1.0903 1.0990 1.0993 1.0897 1.0908 1.0933 1.0944 1.0946 1.0948 1.0953 1.0797 1.0756 1.0663
irintensity: 1.9712 5.3758 0.6485 0.3005 0.8749 0.0589 4.1468 0.6684 8.5248 9.0930 1.9757 5.1501 1.6727 0.0593 2.7582 0.9740 2.5657 4.9540 1.5323 6.5760 0.1190 7.3224 18.6221 7.8412 119.1039 0.5302 5.5418 2.9879 0.3548 0.0681 0.0349 13.3335 6.3753 3.7390 1.7524 8.7844 37.0524 43.3063 64.0112 8.4572 13.6112 5.7599 0.3527 25.4467 26.0354 9.5731 10.1411 0.9025 0.2833 10.0938 24.0381 25.3826 2.8582 0.6414 2.4479 7.2839 7.4077 57.4160 75.0448 104.8890 0.1691 83.3575 1.2508 20.7685 5.2600 11.8529 5.1085 4.6035 1.4867 101.8208 1.2294 2.6570 15.1868 27.8549 127.5142 47.8658 0.1885 0.2265 42.6001 32.2148 68.7850 2.6554 1.5525 0.7330 150.4157 65.2330 51.0758 109.9581 235.9282 293.9449 28.1014 85.2264 14.1752 41.1753 7.9580 45.5268 36.1604 107.2329 22.6794 11.6841 43.5479 4.5196 28.9685 19.4764 13.8109 13.3406 27.5710 125.1686 167.9222 436.0863 135.6248 296.4910 349.6534 104.5651 73.3819 23.8002 84.3142 82.9089 85.8762 11.6094 80.8224 101.4118 85.2898 52.3941 50.3999 26.8801 12.4604 22.4153 14.8510 22.3935 28.7392 14.6793 6.1674 15.9669 4.2233 5.7754 8.1925 8.2014 133.3201 12.9333 78.1684
temp: 298.150 k
press: 1.00000 atm
elementType: 8 8 8 8 8 7 7 6 6 6 6 6 6 6 6 6 6 6 6 6 6 6 6 6 6 6 6 6 6 1 1 1 1 1 1 1 1 1 1 1 1 1 1 1 1 1 1 1 1
symmnumber: 1
zpe: 990316.1 jmol-1
zpe.correction: 0.377191 hartree
zpe.thermalcorrener: 0.403607 hartree
zpe.thermalcorrenthalpy: 0.404552 hartree
zpe.thermalcorrgfe: 0.317490 hartree
zpe.sumelectzpe: -1333.920112 hartree
zpe.sumelectthermal: -1333.893696 hartree
zpe.sumelectthermalent: -1333.892752 hartree
zpe.sumelectthermalfe: -1333.979813 hartree
dipole: -3.4429 4.6074 -0.4593
dipole: 5.7699
quadrupole: -109.2816 -153.1311 -177.0316
quadrupole: -23.8313 1.9851 -1.0021
quadrupole: 37.1998 -6.6497 -30.5502 -23.8313 1.9851 -1.0021
hfenergy: -1334.2973036 hartree
pointgroup: C01 [X(C22H20N2O5)]
dipole: 1.3963589 1.7882299 -0.0749458 debye
polarizability: 559.2054985|0.4133052|318.7014383|-38.7298178|-15.3057948|118.8439017 unknown
InChI: InChI=1S/C22H20N2O5/c1-28-17-8-4-15(5-9-17)23-21(26)14-3-12-20(25)19(13-14)22(27)24-16-6-10-18(29-2)11-7-16/h3-13,23-25H,1-2H3
charge 0 multiplicity 1
49 atoms
O  2.554851 2.915698 -0.441771
O  1.451131 -1.22176 -0.222325
O  -3.852569 2.312552 -0.030073
O  7.771636 -3.049781 -0.660881
O  -8.198534 -2.661615 0.935545
N  3.219514 0.312713 -0.419339
N  -3.27728 0.06037 0.281613
C  0.900869 1.132805 -0.254524
C  -1.502942 1.723871 -0.074773
C  -0.463005 0.769868 -0.133832
C  1.203161 2.521764 -0.321601
C  -1.1628 3.099828 -0.152138
C  1.881373 -0.022711 -0.29822
C  -2.971034 1.396679 0.055649
C  0.178481 3.495349 -0.27329
C  4.340818 -0.560232 -0.478998
C  -4.559558 -0.542488 0.434364
C  5.622386 0.036311 -0.599138
C  4.243103 -1.980414 -0.42422
C  -4.595175 -1.947067 0.665407
C  -5.779191 0.177571 0.368487
C  6.684419 -2.161515 -0.607751
C  6.791271 -0.749632 -0.663907
C  5.407495 -2.763655 -0.488644
C  -7.034331 -1.895177 0.760084
C  -5.816252 -2.61789 0.826806
C  -7.008724 -0.498397 0.530388
C  9.110029 -2.469708 -0.780158
C  -9.481285 -1.958333 0.874037
H  -0.628673 -0.314609 -0.105087
H  -1.974793 3.832589 -0.117894
H  0.433076 4.561743 -0.330562
H  3.419073 1.322019 -0.468436
H  -2.490282 -0.586195 0.362782
H  5.710629 1.129291 -0.64213
H  3.25936 -2.442946 -0.331836
H  -3.659032 -2.518007 0.717797
H  -5.752331 1.254284 0.193654
H  7.762765 -0.255567 -0.756412
H  5.347351 -3.855504 -0.447486
H  -5.851815 -3.69659 1.004486
H  -7.935255 0.080721 0.474944
H  2.64666 3.898196 -0.485649
H  9.795784 -3.32942 -0.799595
H  9.216596 -1.887727 -1.716846
H  9.348749 -1.82277 0.086983
H  -9.558587 -1.190681 1.668803
H  -10.243405 -2.735163 1.03368
H  -9.63363 -1.483467 -0.114999
