program: Gaussian 09
title: 000207045
version: EM64L-G09RevD.01
frameworkgroup: C1[X(C17H12N2O4)]
method: RPBEPBE
basis: SDD
operation: Freq
keyword: #p
keyword: freq=noraman
keyword: PBEPBE/SDD
title: #p freq=noraman PBEPBE/SDD
converged: YES YES NO NO
title: Mulliken charges:
elementType: O O O O N N C C C C C C C C C C C C C C C C C H H H H H H H H H H H H
charge: -0.293311 -0.192952 -0.206701 -0.177608 0.002182 0.017343 -0.122500 0.499085 0.265826 0.228489 -0.428504 -0.377334 -0.321001 0.259450 0.446420 0.161296 -0.338078 -0.316728 -0.166849 -0.383191 -0.372035 -0.372113 -0.803796 0.247377 0.284120 0.255222 0.264534 0.279037 0.236899 0.236345 0.236470 0.252114 0.242769 0.228061 0.229664
chargesum: 0.00000
title: Mulliken charges with hydrogens summed into heavy atoms:
elementType: O O O O N N C C C C C C C C C C C C C C C C C
charge: -0.293311 -0.192952 -0.206701 -0.177608 0.002182 0.017343 -0.122500 0.499085 0.265826 0.228489 -0.181127 -0.093214 -0.065780 0.259450 0.446420 0.161296 -0.073544 -0.037691 0.070050 -0.146846 -0.135565 -0.120000 -0.103301
polarizability: 3.18664890e+02 1.26963980e+00 2.45481827e+02 1.43936338e+01 -7.27241527e+00 1.29009634e+02
1716.lowfreq: -6.5251 -3.5442 0.0003 0.0005 0.0008 2.9054 10.1978 15.2399 28.0602
frequency: 9.9094 15.0590 27.9922 38.6451 50.0029 65.3851 77.8595 105.3194 119.6123 156.6366 194.4387 220.4130 251.3069 267.0634 284.2172 307.8811 327.5635 340.0825 386.0200 405.0088 429.8769 435.6097 471.4608 479.9891 513.2737 532.7002 553.8518 583.8218 607.6704 614.7718 631.6785 643.7812 657.9524 689.7321 717.3678 734.9799 740.0723 755.0389 790.3782 796.8917 815.6978 845.1770 854.9244 858.9202 864.8171 907.2129 946.8121 947.6153 975.3950 983.1583 990.4495 994.0998 995.5489 1017.3099 1034.2769 1047.1141 1063.9911 1126.7145 1141.3884 1153.2224 1181.3710 1200.3481 1206.3785 1223.2154 1224.9197 1234.4545 1252.0538 1310.1383 1327.4286 1358.4191 1375.2298 1378.3661 1397.4764 1404.4083 1413.0927 1423.0619 1441.5874 1469.1107 1472.8417 1491.0322 1502.6848 1554.2248 1577.0270 1594.4674 1610.5921 1621.3345 1671.8149 2977.2354 3059.4444 3090.2753 3129.9875 3132.8330 3134.6771 3140.2696 3145.3787 3160.3327 3172.3535 3182.3172 3185.9805
redmass: 1.0289 5.3202 4.4666 10.4998 6.0876 7.9983 6.0128 5.2446 6.9800 6.0904 6.2075 6.1357 5.3352 5.4393 5.8149 7.9447 9.5708 3.3429 7.8369 2.8517 4.1539 6.0275 3.1753 3.9372 7.9302 5.3903 4.7774 6.4501 6.6391 6.4592 6.8209 5.7447 4.9764 6.6981 5.7805 3.0228 7.8153 6.9439 1.3747 4.3630 5.6633 1.5320 1.7037 1.2516 5.7060 7.5201 1.4229 7.2099 1.3448 1.3442 1.4406 1.3841 1.3944 2.7273 2.5330 1.6033 4.1631 1.3032 1.7920 1.5237 1.6469 1.6600 3.3690 2.4890 3.0015 2.4912 3.0147 1.2804 4.4912 5.5800 3.3943 3.4580 1.2214 2.4773 3.6104 4.5321 3.1255 1.1043 1.0575 3.9695 2.6514 9.0018 6.3750 6.0412 7.4377 6.3102 12.6414 1.0391 1.0942 1.1001 1.0890 1.0888 1.0903 1.0917 1.0903 1.0959 1.0994 1.0950 1.0950
irintensity: 0.8135 2.7073 0.5261 0.6410 3.1086 0.9347 0.6853 0.5937 0.4001 0.5065 4.6439 5.0809 1.9048 2.2817 0.9051 1.3971 1.3013 2.5419 0.8910 0.0684 1.5458 6.2853 5.7143 4.3289 2.2259 10.3009 1.7688 7.4647 8.3617 2.1784 6.0276 8.6186 27.0295 1.6791 15.7782 9.4234 34.0849 22.7265 16.5182 43.8879 6.6080 33.6315 70.0235 0.1560 8.0492 6.7297 3.5397 556.9381 2.1624 1.8349 20.4784 0.7964 0.9560 10.0096 0.6161 30.3226 242.4308 8.5964 20.8958 9.0889 358.4183 100.9448 154.4010 50.2296 0.2049 247.0481 18.0479 1.5486 8.7745 35.2587 102.5697 31.1149 14.4687 10.1196 10.6187 16.4746 59.2218 15.5905 12.9490 18.0700 9.5484 42.6924 7.6813 8.3479 27.7527 97.3796 242.7049 25.5983 20.2886 16.0155 14.1287 8.9558 17.5352 8.4969 9.6742 8.3353 25.0987 1.3440 3.5721
temp: 298.150 k
press: 1.00000 atm
elementType: 8 8 8 8 7 7 6 6 6 6 6 6 6 6 6 6 6 6 6 6 6 6 6 1 1 1 1 1 1 1 1 1 1 1 1
symmnumber: 1
zpe: 664067.0 jmol-1
zpe.correction: 0.252930 hartree
zpe.thermalcorrener: 0.272382 hartree
zpe.thermalcorrenthalpy: 0.273326 hartree
zpe.thermalcorrgfe: 0.200481 hartree
zpe.sumelectzpe: -1063.738190 hartree
zpe.sumelectthermal: -1063.718738 hartree
zpe.sumelectthermalent: -1063.717794 hartree
zpe.sumelectthermalfe: -1063.790639 hartree
dipole: 0.7536 -5.4008 -1.9863
dipole: 5.8036
quadrupole: -84.8389 -136.9075 -134.6903
quadrupole: -10.7203 -1.7905 -1.7853
quadrupole: 33.9733 -18.0952 -15.8781 -10.7203 -1.7905 -1.7853
hfenergy: -1063.99112 hartree
pointgroup: C01 [X(C17H12N2O4)]
dipole: 0.5429938 2.2112644 0.1700941 debye
polarizability: 316.6039779|-14.3280222|235.0451441|-16.895106|-35.2520246|141.5072293 unknown
InChI: InChI=1S/C17H12N2O4/c1-11-4-6-13(7-5-11)17(20)23-16-14(19(21)22)9-8-12-3-2-10-18-15(12)16/h2-10H,1H3
charge 0 multiplicity 1
35 atoms
O  -0.114437 -0.521425 0.354411
O  -0.380514 -0.030296 -1.93448
O  1.909623 -4.141249 0.556528
O  0.118859 -3.008752 1.401211
N  1.305926 1.792746 -0.187065
N  1.278877 -3.045865 0.843974
C  2.019729 0.62031 -0.007943
C  3.461841 0.559554 -0.07331
C  1.27128 -0.582401 0.278018
C  1.972849 -1.776197 0.526992
C  4.131336 -0.68426 0.164937
C  3.400663 -1.827732 0.461437
C  4.156527 1.777102 -0.371073
C  -2.277201 0.195265 -0.403366
C  -4.997845 0.739086 0.246963
C  -0.878917 -0.077339 -0.797178
C  -3.17631 0.646646 -1.405734
C  -2.742005 0.014473 0.925347
C  3.429683 2.951696 -0.569676
C  -4.517369 0.917662 -1.078785
C  -4.087219 0.286487 1.239277
C  2.001557 2.911578 -0.456764
C  -6.453262 0.99738 0.5873
H  5.224671 -0.72571 0.115316
H  3.883311 -2.79185 0.639602
H  5.250174 1.77012 -0.437034
H  -2.804278 0.781497 -2.426882
H  -2.048152 -0.342373 1.690602
H  3.927621 3.898149 -0.800579
H  -5.204496 1.271037 -1.856549
H  -4.441017 0.143884 2.267069
H  1.412526 3.826282 -0.589396
H  -7.05273 0.073668 0.467883
H  -6.895797 1.762735 -0.073757
H  -6.573103 1.331493 1.632601
