program: Gaussian 09
title: 000207053
version: EM64L-G09RevD.01
frameworkgroup: C1[X(C20H14Cl2N2O3)]
method: RPBEPBE
basis: SDD
operation: Freq
keyword: #p
keyword: freq=noraman
keyword: PBEPBE/SDD
title: #p freq=noraman PBEPBE/SDD
converged: YES YES NO NO
title: Mulliken charges:
elementType: Cl Cl O O O N N C C C C C C C C C C C C C C C C C C C C H H H H H H H H H H H H H H
charge: -0.069502 -0.063996 -0.510283 -0.284937 -0.269955 -0.490194 -0.484873 0.064597 0.290252 -0.410635 0.260544 -0.335817 0.132101 0.126091 -0.393659 0.508998 0.524170 -0.441051 -0.357889 -0.441263 -0.357085 -0.042627 -0.189828 -0.046698 -0.191012 -0.258611 -0.256096 0.251319 0.285971 0.227850 0.393377 0.324705 0.252581 0.314083 0.253166 0.314236 0.233449 0.233436 0.258096 0.258275 0.388713
chargesum: 0.00000
title: Mulliken charges with hydrogens summed into heavy atoms:
elementType: Cl Cl O O O N N C C C C C C C C C C C C C C C C C C C C
charge: -0.069502 -0.063996 -0.121570 -0.284937 -0.269955 -0.096817 -0.160167 0.064597 0.290252 -0.159316 0.260544 -0.049846 0.132101 0.126091 -0.165809 0.508998 0.524170 -0.188470 -0.043806 -0.188097 -0.042849 -0.042627 0.043621 -0.046698 0.042424 -0.000515 0.002179
polarizability: 4.75587024e+02 4.83853282e+00 3.20844341e+02 -5.78796862e+00 -6.82216268e-01 9.66440041e+01
1716.lowfreq: -4.0581 -1.1056 -0.0015 -0.0011 0.0012 3.0907 7.7134 16.1176 27.2420
frequency: 7.3901 16.1087 27.2376 42.1487 45.0078 62.7050 70.1627 87.6768 117.2602 128.6149 150.5102 184.5477 187.1680 194.7471 202.1853 220.5006 239.3828 266.2878 269.8714 313.6385 327.2994 354.1270 358.3757 360.5314 386.4394 410.6044 412.1347 425.3081 432.1512 438.5775 443.2320 526.3284 532.7180 553.9126 560.6972 569.7741 589.1965 637.2511 644.7435 655.6677 666.2374 673.9177 685.8807 687.3093 710.3296 739.4861 757.3638 791.7072 791.9152 806.1778 813.4160 831.9217 852.4461 857.7994 860.2402 864.7092 875.1083 915.4611 916.4380 930.6734 941.3687 978.3053 978.5146 986.8873 994.4220 995.3545 1065.9116 1071.2499 1072.7913 1094.0154 1096.2604 1099.5651 1123.9033 1160.9285 1177.1122 1177.5850 1214.1829 1228.4996 1250.1309 1259.5331 1270.1373 1294.4870 1307.0772 1316.5290 1372.2679 1372.7431 1396.7849 1401.0467 1410.4314 1420.0331 1471.2974 1473.1010 1481.1781 1518.5174 1543.5057 1574.3814 1578.2078 1588.9056 1599.0740 1611.4278 1613.4960 1619.4222 1640.1444 3116.1041 3122.8446 3140.8053 3146.8661 3147.1858 3149.6072 3169.2308 3178.9070 3179.1303 3203.1382 3203.4869 3379.6532 3538.9159 3598.5507
redmass: 6.9086 9.5322 10.8822 6.1419 5.7305 7.6544 10.4178 7.2880 6.6158 9.5253 5.3559 5.4571 5.3852 8.3064 9.1606 7.6478 4.2335 4.8241 7.6507 7.5266 4.0722 7.3175 1.2544 7.3051 7.0923 8.5026 8.4328 3.2392 7.8846 3.0678 3.1670 4.4533 5.0030 7.8418 3.7614 4.8216 5.9193 7.4397 1.4425 7.3271 4.9325 7.6336 2.2891 2.2905 7.9418 4.9815 3.6158 1.3215 1.3317 7.2768 1.2403 1.5635 8.6302 5.8705 5.8315 1.6039 1.4962 1.3672 1.3690 5.9457 1.5362 5.9399 5.9230 1.3529 1.3129 1.3124 2.8066 2.2471 2.0051 1.9512 1.5564 2.0101 2.0006 1.1605 1.0887 1.0884 2.6295 2.9483 1.8453 3.0788 1.7522 1.3234 1.6334 1.8305 5.1484 5.2516 5.1157 7.7661 3.5458 3.4444 2.6538 2.7094 2.7678 2.3411 3.2740 8.4515 8.6048 4.3586 3.9035 6.0233 6.4605 5.1276 2.4980 1.0907 1.0903 1.0927 1.0891 1.0890 1.0924 1.0947 1.0958 1.0957 1.0953 1.0952 1.0800 1.0757 1.0664
irintensity: 1.4826 0.0192 0.1028 1.8551 3.8988 6.2569 1.6644 0.7366 1.5474 6.2538 0.2664 0.6049 0.8053 2.3819 1.9893 8.0924 2.4803 3.0861 5.3168 7.9862 12.9269 3.2565 125.5402 6.6108 2.6042 5.0572 7.5178 2.5333 3.1414 3.5638 10.2624 9.6173 2.3286 70.7856 11.9316 0.9667 16.1656 12.9885 33.8459 23.2943 28.4772 11.8936 13.8319 26.1563 6.0110 28.7835 1.4032 71.6688 55.2542 9.8617 24.4141 37.9106 2.4103 32.0706 50.7175 41.2116 91.2086 4.5325 5.9076 0.6272 16.6150 12.6634 10.3701 1.3017 4.9764 4.9781 73.7832 24.5152 58.0168 59.4529 57.9135 14.4297 119.2434 0.2702 0.6774 0.0275 111.3144 73.9145 14.0832 127.5081 33.3919 69.9370 126.6338 19.5208 199.9943 37.2327 20.2516 9.6381 60.8308 68.1885 214.1243 78.0063 225.7371 238.8152 297.7727 177.3267 115.6770 206.2370 264.1929 63.3831 72.5723 63.7256 77.5447 21.1531 12.0326 5.0285 12.0702 10.5914 1.6310 4.3919 3.4501 3.1499 9.7028 8.6775 153.7032 15.1109 87.4522
temp: 298.150 k
press: 1.00000 atm
elementType: 17 17 8 8 8 7 7 6 6 6 6 6 6 6 6 6 6 6 6 6 6 6 6 6 6 6 6 1 1 1 1 1 1 1 1 1 1 1 1 1 1
symmnumber: 1
zpe: 775155.6 jmol-1
zpe.correction: 0.295241 hartree
zpe.thermalcorrener: 0.318836 hartree
zpe.thermalcorrenthalpy: 0.319780 hartree
zpe.thermalcorrgfe: 0.237771 hartree
zpe.sumelectzpe: -2023.998011 hartree
zpe.sumelectthermal: -2023.974417 hartree
zpe.sumelectthermalent: -2023.973473 hartree
zpe.sumelectthermalfe: -2024.055482 hartree
dipole: 1.8846 4.1999 -0.4299
dipole: 4.6233
quadrupole: -185.2320 -151.1057 -177.1471
quadrupole: 7.9592 -0.8577 -2.1739
quadrupole: -14.0704 20.0559 -5.9855 7.9592 -0.8577 -2.1739
hfenergy: -2024.2932526 hartree
pointgroup: C01 [X(C20H14Cl2N2O3)]
dipole: 0.5000378 1.7086685 -0.3728867 debye
polarizability: 464.5404665|19.5265602|322.4124297|-53.9798792|-22.1257812|106.1224736 unknown
InChI: InChI=1S/C20H14Cl2N2O3/c21-13-3-1-5-15(10-13)23-19(26)12-7-8-18(25)17(9-12)20(27)24-16-6-2-4-14(22)11-16/h1-11,23-25H
charge 0 multiplicity 1
41 atoms
Cl 8.388859 0.295919 -1.15789
Cl -5.697167 -4.533888 0.896491
O  2.484217 2.98668 -0.708065
O  1.552862 -1.128174 0.010995
O  -3.815639 2.279273 0.451876
N  3.248522 0.432725 -0.446874
N  -3.227477 0.008761 0.377257
C  0.912142 1.190539 -0.222441
C  -1.494476 1.724276 0.048097
C  -0.426219 0.801152 0.028435
C  1.159718 2.572597 -0.455656
C  -1.208466 3.095758 -0.181897
C  1.93033 0.067983 -0.209171
C  -2.937874 1.371015 0.311697
C  0.106329 3.516466 -0.43293
C  4.391791 -0.40677 -0.493414
C  -4.479528 -0.616706 0.629047
C  5.636511 0.232301 -0.757516
C  4.350071 -1.814419 -0.294621
C  -4.491743 -2.039665 0.641285
C  -5.682926 0.103496 0.862028
C  6.802685 -0.544567 -0.816796
C  5.548172 -2.556111 -0.363218
C  -5.700899 -2.708139 0.885181
C  -6.875291 -0.610486 1.10433
C  6.793632 -1.939326 -0.624594
C  -6.908594 -2.023972 1.120557
H  -0.545939 -0.272921 0.219169
H  -2.039466 3.807079 -0.152773
H  0.317836 4.57843 -0.611776
H  3.404341 1.438381 -0.61013
H  -2.450538 -0.634914 0.215567
H  5.687121 1.315105 -0.91287
H  3.393185 -2.296793 -0.092513
H  -3.574074 -2.612011 0.46529
H  -5.665255 1.193687 0.848004
H  5.513551 -3.639945 -0.209831
H  -7.801591 -0.054584 1.284095
H  7.718688 -2.51934 -0.676553
H  -7.83579 -2.571523 1.30814
H  2.547792 3.961926 -0.851514
