program: Gaussian 09
title: 000207031
version: EM64L-G09RevD.01
frameworkgroup: C1[X(C9H20N2S2)]
method: RPBEPBE
basis: SDD
operation: Freq
keyword: #p
keyword: freq=noraman
keyword: PBEPBE/SDD
title: #p freq=noraman PBEPBE/SDD
converged: YES YES NO NO
title: Mulliken charges:
elementType: S S N N C C C C C C C C C H H H H H H H H H H H H H H H H H H H H
charge: -0.003980 0.012723 -0.096864 0.070574 -0.348507 -0.448915 -0.328381 -0.323291 -0.352535 -0.673347 -0.671449 -0.643892 -0.545292 0.202643 0.241478 0.272259 0.231854 0.204691 0.192881 0.198817 0.194738 0.257863 0.209969 0.224116 0.225731 0.206621 0.211063 0.226274 0.208415 0.209777 0.254748 0.219219 0.159999
chargesum: 0.00000
title: Mulliken charges with hydrogens summed into heavy atoms:
elementType: S S N N C C C C C C C C C
charge: 0.156019 0.012723 -0.096864 0.070574 0.095614 0.055198 0.069191 0.070264 0.115297 -0.016879 -0.025696 0.039851 -0.545292
polarizability: 1.88368798e+02 -3.06381434e+00 1.57598987e+02 -1.22677721e+01 -5.78845017e+00 1.02236504e+02
1716.lowfreq: -7.8814 -0.0024 -0.0020 -0.0019 4.9116 9.1593 25.6531 31.4845 46.2890
frequency: 25.5798 31.3772 46.2471 67.7860 78.1497 84.8023 88.3868 109.3841 154.2325 196.4165 214.6456 229.3606 248.4031 275.1179 292.1086 297.2479 311.4679 324.0595 358.0843 394.1884 406.8367 447.5147 462.8605 488.9686 560.1162 599.7045 744.1658 773.6561 782.7294 793.8504 797.4621 807.4974 856.7041 913.9987 965.5174 984.1673 991.7782 1029.5839 1050.3907 1074.3212 1076.4586 1085.0377 1085.9479 1099.0129 1131.2164 1160.1663 1209.1341 1210.0356 1252.9765 1280.9732 1283.9948 1290.6997 1297.0852 1320.1286 1353.7026 1361.1539 1367.1228 1377.7793 1386.5868 1388.4256 1391.1238 1427.7792 1456.9982 1462.6067 1465.2453 1468.5139 1470.4430 1479.0424 1482.9065 1486.1017 1486.4464 1490.8544 1501.3719 2469.0279 2856.1357 2866.4458 2893.8325 2982.1345 2984.2844 2987.5496 3001.5590 3011.9940 3016.9551 3036.7122 3056.9830 3066.1259 3075.4406 3077.4326 3083.6394 3085.8544 3091.1752 3091.7628 3102.8586
redmass: 3.7548 4.1550 5.2396 2.9144 2.9166 3.4203 2.1494 3.1413 1.6571 1.5653 1.1436 1.6884 1.7680 3.1398 2.1227 3.9494 1.0745 3.1842 3.8575 3.3718 2.7044 2.9460 3.0221 3.3463 4.9448 4.6545 2.4937 1.3372 1.2724 1.2886 1.1544 1.3959 1.7944 1.9261 2.9937 2.5514 2.4008 3.3992 2.0258 2.6911 1.8981 2.0323 2.1421 1.8240 1.6995 2.0141 2.4464 2.6941 1.5351 1.1971 1.2406 1.2475 1.1615 1.3025 1.2499 1.3377 1.3310 1.3491 1.2130 1.2340 1.2286 1.7552 1.0896 1.0521 1.0978 1.0449 1.0621 1.0652 1.0525 1.0708 1.0900 1.0789 1.3544 1.0376 1.0714 1.0716 1.0711 1.0358 1.0358 1.0356 1.0615 1.0877 1.0603 1.0876 1.0894 1.1010 1.0989 1.0983 1.1034 1.1003 1.1004 1.1004 1.1016
irintensity: 0.1207 0.5375 0.4669 0.1837 0.2646 0.8398 0.3725 0.4769 0.6180 0.5372 0.3664 0.9529 3.0066 1.0456 2.8907 2.9897 32.2696 3.2207 13.9867 12.5526 4.9191 2.5769 8.6621 6.4577 6.8548 6.1876 8.8769 0.4169 14.5017 29.8755 3.6870 18.3191 48.0731 1.1106 64.0118 8.1824 12.7451 5.0780 2.0626 39.9164 27.1454 9.4839 2.2368 69.2738 15.8303 42.6978 6.7719 56.3957 42.8180 16.9657 27.4135 33.9287 24.8717 1.3900 7.1988 2.9650 2.4142 8.7633 22.1293 26.6728 16.2450 137.6861 16.1628 9.9637 14.6116 12.3226 7.5677 9.8075 6.1205 14.2486 13.9688 10.3207 88.0101 4.2045 48.9916 135.3425 93.9616 26.5647 31.6065 26.9162 38.4760 27.8866 18.7289 19.6728 5.2923 0.7037 32.4178 75.0677 29.3171 29.8390 27.2861 53.4796 20.5522
temp: 298.150 k
press: 1.00000 atm
elementType: 16 16 7 7 6 6 6 6 6 6 6 6 6 1 1 1 1 1 1 1 1 1 1 1 1 1 1 1 1 1 1 1 1
symmnumber: 1
zpe: 737401.1 jmol-1
zpe.correction: 0.280861 hartree
zpe.thermalcorrener: 0.298225 hartree
zpe.thermalcorrenthalpy: 0.299170 hartree
zpe.thermalcorrgfe: 0.233802 hartree
zpe.sumelectzpe: -1259.479009 hartree
zpe.sumelectthermal: -1259.461645 hartree
zpe.sumelectthermalent: -1259.460701 hartree
zpe.sumelectthermalfe: -1259.526068 hartree
dipole: -4.0064 1.9512 -0.2549
dipole: 4.4636
quadrupole: -107.7458 -89.4219 -99.4501
quadrupole: 1.2627 4.2715 -0.6850
quadrupole: -8.8732 9.4507 -0.5775 1.2627 4.2715 -0.6850
hfenergy: -1259.75987 hartree
pointgroup: C01 [X(C9H20N2S2)]
dipole: -1.519488 0.8803597 0.0013161 debye
polarizability: 186.3292572|-4.9604102|158.4402784|-16.9205897|-2.90207|103.4347534 unknown
InChI: InChI=1S/C9H20N2S2/c1-4-10(5-2)7-8-11(6-3)9(12)13/h12H,4-8H2,1-3H3
charge 0 multiplicity 1
33 atoms
S  1.676839 -2.375434 0.342116
S  4.072091 -0.80333 -0.865988
N  -2.155601 0.043708 -0.191628
N  1.651815 0.293993 -0.183986
C  -0.788727 -0.06537 -0.74792
C  0.264301 0.252388 0.347194
C  -3.071868 -1.044362 -0.626565
C  -2.730049 1.40855 -0.32644
C  2.136119 1.625092 -0.647531
C  -2.759393 -2.391235 0.052948
C  -3.785897 1.733454 0.747522
C  2.85984 2.401771 0.47041
C  2.470209 -0.798061 -0.269764
H  -0.633565 0.615106 -1.619358
H  -0.615066 -1.091705 -1.114291
H  0.183804 -0.492977 1.156699
H  0.047513 1.238072 0.797158
H  -4.100809 -0.743999 -0.357832
H  -3.058629 -1.168253 -1.738703
H  -1.898449 2.133053 -0.229046
H  -3.165294 1.568393 -1.345704
H  2.821458 1.45753 -1.496181
H  1.254594 2.185288 -1.011019
H  -1.736984 -2.742493 -0.177429
H  -2.844362 -2.291923 1.149109
H  -3.466562 -3.169665 -0.289587
H  -4.659511 1.060086 0.684558
H  -3.34871 1.62777 1.755666
H  -4.154331 2.769167 0.625512
H  2.202034 2.561808 1.344108
H  3.754872 1.84625 0.797039
H  3.181479 3.39044 0.09564
H  2.817238 -3.114215 0.099195
