program: Gaussian 09
title: 000207030
version: EM64L-G09RevD.01
frameworkgroup: C1[X(C6H13N3O2S2)]
method: RPBEPBE
basis: SDD
operation: Freq
keyword: #p
keyword: freq=noraman
keyword: PBEPBE/SDD
title: #p freq=noraman PBEPBE/SDD
converged: YES YES NO NO
title: Mulliken charges:
elementType: S S O O N N N C C C C C C H H H H H H H H H H H H H
charge: 0.212574 -0.053071 -0.462776 -0.247446 -0.033846 -0.400281 -0.354300 -0.352092 -0.349736 -0.366254 -0.364811 0.247591 -0.844261 0.239429 0.219269 0.205833 0.240737 0.244233 0.246653 0.249626 0.237044 0.316484 0.264025 0.247259 0.272702 0.385416
chargesum: 0.00000
title: Mulliken charges with hydrogens summed into heavy atoms:
elementType: S S O O N N N C C C C C C
charge: 0.212574 -0.053071 -0.077360 -0.247446 -0.033846 -0.400281 -0.037816 0.106607 0.096833 0.124632 0.121859 0.247591 -0.060276
polarizability: 1.58627996e+02 -2.05821271e+01 1.45952551e+02 2.85748317e+00 -4.83942801e+00 1.00043922e+02
1716.lowfreq: -18.2369 -0.0025 -0.0019 -0.0017 5.3556 10.8438 30.8267 34.1098 57.9948
frequency: 30.5649 33.7516 57.9571 73.7178 81.1597 85.3549 110.6218 150.7358 168.7474 215.8980 242.7978 292.4986 330.8339 350.5137 358.3564 403.7904 418.1279 462.6877 466.3403 478.7255 563.1782 587.8071 623.3668 645.7950 656.8357 699.1483 791.7422 827.4581 923.0215 925.2471 938.8007 956.7926 964.9089 999.7803 1029.5675 1041.6147 1063.0494 1105.4041 1117.2357 1177.4398 1182.1849 1198.4010 1264.2046 1271.1429 1282.6624 1308.3181 1327.9886 1336.0107 1341.2675 1342.7912 1362.2993 1435.6420 1441.7196 1447.8563 1456.6845 1457.2146 1469.2650 1502.9756 1712.9828 2897.8280 2910.4103 2997.8238 3001.4574 3005.5309 3065.2358 3068.9110 3095.7452 3101.5991 3109.2827 3130.2780 3416.6899 3590.1130
redmass: 6.7200 7.2234 4.3339 4.7136 5.6196 3.3707 1.1851 4.7244 3.5154 3.1794 3.5564 6.7476 20.2707 3.2383 2.7031 3.8079 2.4232 4.6612 2.5447 1.1590 4.1885 1.2202 5.4933 7.0924 2.2691 9.5752 4.2878 1.5511 3.9824 2.2592 5.6343 1.2260 1.1765 2.6822 2.3758 1.7105 2.0159 2.2010 4.8620 1.9502 2.0420 1.6375 1.5733 1.4342 1.6921 1.3581 1.2461 1.1466 1.2698 1.2614 1.3678 1.0788 1.0571 1.0873 1.0852 1.0569 1.1402 1.6010 8.8110 1.0699 1.0692 1.0290 1.0631 1.0641 1.0908 1.0933 1.1004 1.1009 1.1033 1.1044 1.0760 1.0653
irintensity: 1.2961 1.8930 2.6504 1.8125 0.5596 0.4471 0.1233 9.4155 5.5174 3.1198 3.5297 0.7164 27.0189 8.4970 2.7351 5.2638 1.7322 57.9409 18.3476 190.7483 25.5092 55.9999 0.8997 0.6973 4.9092 17.8902 7.1655 0.0043 65.1475 1.4304 29.9719 15.3883 13.5584 230.0985 0.9527 4.7002 210.2404 44.7427 13.8877 3.7766 24.5822 0.1704 27.3091 23.9344 1.9827 2.3483 0.2124 1.7165 6.3647 20.2183 6.5755 13.4601 19.2017 16.8945 2.0784 8.3858 3.5694 109.8801 402.9711 43.8927 39.2520 30.7986 14.3043 49.5216 26.7340 22.8263 11.4047 7.2627 11.6714 14.0672 34.7767 55.0062
temp: 298.150 k
press: 1.00000 atm
elementType: 16 16 8 8 7 7 7 6 6 6 6 6 6 1 1 1 1 1 1 1 1 1 1 1 1 1
symmnumber: 1
zpe: 532241.9 jmol-1
zpe.correction: 0.202720 hartree
zpe.thermalcorrener: 0.217933 hartree
zpe.thermalcorrenthalpy: 0.218878 hartree
zpe.thermalcorrgfe: 0.158109 hartree
zpe.sumelectzpe: -1346.178277 hartree
zpe.sumelectthermal: -1346.163064 hartree
zpe.sumelectthermalent: -1346.162120 hartree
zpe.sumelectthermalfe: -1346.222888 hartree
dipole: -0.0344 1.7180 0.9168
dipole: 1.9476
quadrupole: -103.1923 -91.6848 -89.2680
quadrupole: 5.2900 -8.4683 5.2936
quadrupole: -8.4773 3.0302 5.4470 5.2900 -8.4683 5.2936
hfenergy: -1346.3809974 hartree
pointgroup: C01 [X(C6H13N3O2S2)]
dipole: -0.0578612 -0.0319422 -0.7633876 debye
dipolederiv: 0.5726675 0.4201364 0.2967259 0.3489629 0.3522222 0.4659259 0.1075549 0.3663837 0.2222406 -0.3246639 0.0103368 0.0417452 -0.3230675 -0.3518297 -0.2770763 -0.1964817 -0.1804109 -0.2849145 -0.8861102 0.3270284 0.3598905 0.4852695 -0.6239887 -0.2418155 0.5154589 -0.2159731 -0.7441478 -0.8575531 -0.2100732 -0.0722928 -0.307812 -0.7137903 -0.26169 -0.1408594 -0.2784589 -0.5351044 -0.1804344 -0.0584124 -0.0658282 -0.2978404 -0.2931459 -0.0065054 -0.2804532 -0.0525542 -0.2060827 -0.5977763 -0.2218498 -0.2137505 0.1123112 -0.5421536 -0.2826752 0.1851168 -0.1298826 -0.512535 -1.0085129 -0.1489803 -0.0167101 -0.2267229 -0.2419731 0.2382067 -0.0769178 0.2285654 -0.2565879 0.0894086 0.1831569 -0.0349455 0.2974532 0.2499404 -0.0458679 -0.1019409 -0.1629281 0.2003927 0.2838546 -0.0078843 0.2265086 -0.0700723 0.1696506 -0.0947602 0.3506272 0.0274936 0.162739 0.2744403 -0.0607778 0.1471677 -0.3036204 0.1565702 -0.0049477 0.2459655 0.1433147 0.3742131 0.0924002 0.0561916 -0.0876177 0.1728905 0.4043365 0.0953568 -0.3155689 -0.1111331 0.2113522 2.335296 0.1624181 -0.2886116 0.3524265 1.0077237 0.5505297 -0.1705623 0.5891946 0.8062829 0.0332097 -0.01181 -0.0051896 -0.0651085 -0.0514049 -0.1015197 0.0032367 -0.0630145 0.0526495 -0.0687799 0.0626624 -0.1185687 0.0453961 0.0448907 0.0713192 -0.0524366 0.0659714 0.0276359 0.0154622 -0.122057 0.0373467 -0.0846903 -0.0857635 0.002408 0.0091883 -0.0984891 -0.0363377 -0.0662221 0.0160105 -0.1149482 -0.0466505 -0.0619362 -0.1205608 -0.1103507 -0.0233406 -0.0423435 -0.0046512 -0.0864633 0.0551983 -0.0411243 0.015733 0.0904303 0.0440616 0.1079305 -0.0074352 0.0190842 -0.0396876 0.1062232 -0.0016633 0.0252898 0.0941462 0.0461797 0.0522993 0.011292 -0.0433363 -0.0565225 -0.1310432 -0.0025868 -0.0230619 -0.0963447 -0.0884699 -0.0607527 0.0326521 0.0058808 -0.15103 -0.0312617 -0.1087759 -0.0344476 -0.0542764 0.032086 -0.0611729 0.0110428 -0.0408133 0.1074453 -0.0539505 0.0464111 0.059782 0.0273715 -0.0247583 0.07013 0.0155175 0.0583284 -0.0646365 0.0034018 0.0803035 0.1505621 -0.1546228 0.1301668 -0.1276751 0.1793298 0.118215 -0.0153598 -0.0409441 0.0018716 0.0413703 -0.0452276 -0.0782356 -0.1007623 -0.0744996 -0.0126607 -0.0828339 0.0619933 -0.0711928 -0.0029849 0.1373581 0.0368694 0.0657989 -0.0032678 -0.0513718 0.0848419 -0.0192892 0.1410113 0.0493788 0.0729202 0.0102967 0.0160204 0.0363334 0.2446387 -0.0918499 -0.0412495 -0.1333795 0.2990303 -0.0580825 -0.079773 -0.0665543 0.3595827 unknown
polarizability: 158.0370058|17.4497528|118.2894133|12.7899426|22.5784182|128.2980499 unknown
InChI: InChI=1S/C6H13N3O2S2/c1-12-13-9-4-2-8(3-5-9)7-6(10)11/h7,10H,2-5H2,1H3
charge 0 multiplicity 1
26 atoms
S  -3.326962 -0.038068 0.994646
S  -3.264931 -1.823812 -0.602002
O  3.892639 -0.994402 -1.477291
O  3.636828 0.757624 0.074779
N  0.826146 0.038113 0.111875
N  -1.747154 0.65239 1.226055
N  1.82501 -0.59077 -0.661428
C  0.230704 -0.881674 1.120792
C  -0.188817 0.727028 -0.730131
C  -0.730642 -0.074321 2.025462
C  -1.143103 1.52433 0.190716
C  3.139867 -0.168793 -0.600976
C  -3.711312 -0.878042 -2.173875
H  1.050218 -1.298799 1.730221
H  -0.325978 -1.720578 0.639859
H  -0.778917 0.001759 -1.340821
H  0.338689 1.41916 -1.408285
H  -1.245111 -0.741323 2.735028
H  -0.147592 0.677754 2.590581
H  -0.56388 2.312027 0.709435
H  -1.94776 1.996107 -0.395771
H  1.596604 -1.382508 -1.278436
H  -3.87682 -1.637625 -2.956848
H  -2.892367 -0.207361 -2.478896
H  -4.637311 -0.305281 -2.017576
H  4.837553 -0.699737 -1.437115
