program: Gaussian 09
title: 000207089
version: EM64L-G09RevD.01
frameworkgroup: C1[X(C25H30NO3)]
method: RPBEPBE
basis: SDD
operation: Freq
keyword: #p
keyword: freq=noraman
keyword: PBEPBE/SDD
title: #p freq=noraman PBEPBE/SDD
converged: NO YES NO NO
title: Mulliken charges:
elementType: O O O N C C C C C C C C C C C C C C C C C C C C C C C C C H H H H H H H H H H H H H H H H H H H H H H H H H H H H H H
charge: -0.277690 -0.191104 -0.270005 -0.097307 -0.172022 -0.429334 -0.397820 -0.377607 -0.083146 -0.472126 -0.489661 -0.341454 -0.376189 -0.348758 0.265650 -0.521947 -0.679335 0.393932 0.312215 0.142254 0.135972 -0.392920 -0.385836 -0.356726 -0.361624 -0.246302 -0.276701 -0.208960 -0.219584 0.277719 0.305474 0.293422 0.266233 0.324884 0.272289 0.283576 0.306447 0.247424 0.270460 0.268475 0.253011 0.255246 0.257239 0.232071 0.224871 0.208647 0.205675 0.294220 0.219292 0.212771 0.242495 0.238719 0.244779 0.266992 0.273924 0.242128 0.243517 0.246351 0.245786
chargesum: 1.00000
title: Mulliken charges with hydrogens summed into heavy atoms:
elementType: O O O N C C C C C C C C C C C C C C C C C C C C C C C C C
charge: -0.277690 -0.191104 -0.270005 -0.097307 0.105697 0.169561 0.193296 0.178258 0.223301 0.045758 0.031824 0.171031 0.080754 0.065564 0.265650 -0.227726 -0.004778 0.393932 0.312215 0.142254 0.135972 -0.154201 -0.141057 -0.089734 -0.087699 -0.004174 -0.033184 0.037391 0.026202
polarizability: 3.07500387e+02 -1.68391719e+01 2.86746314e+02 -4.52105037e+01 -1.87393396e+00 2.15032369e+02
1716.lowfreq: -10.8339 -0.0008 -0.0003 0.0006 1.9893 9.5021 15.5165 24.6410 38.3171
frequency: 14.8441 24.6407 38.3060 45.2537 52.1363 57.6015 72.3803 80.4216 95.0451 107.9909 123.3205 140.6513 156.5738 194.1084 200.5022 209.0326 222.3885 240.4825 259.3099 268.5247 271.1326 281.0057 296.8422 318.8145 337.6115 367.7023 391.6734 397.1660 420.6853 434.2910 455.8373 457.2280 467.9840 516.8371 523.0049 526.6169 537.6949 571.1350 588.2670 595.3042 609.8254 645.8063 659.7650 684.4846 699.2285 720.9266 731.1102 738.9421 763.2177 766.7252 771.2259 785.9447 791.0160 813.7693 818.6825 828.0615 839.0529 861.1326 868.9324 869.1749 882.1076 890.5550 892.7507 896.8235 905.5495 924.4279 943.3343 950.1997 952.0333 953.3243 964.3411 985.6715 986.0419 990.7856 1023.5281 1028.0580 1030.4300 1041.9977 1045.1265 1058.3152 1061.4240 1068.1285 1078.2697 1089.3048 1106.0511 1107.7273 1122.9705 1138.4142 1152.3820 1164.8535 1168.5764 1173.3007 1180.3466 1190.8724 1197.1849 1212.0218 1215.5618 1219.5987 1237.0247 1239.1449 1246.9180 1251.5872 1273.5688 1281.1139 1284.0526 1285.2799 1296.6129 1303.7928 1310.7651 1316.0826 1319.7638 1328.3357 1333.7593 1341.0961 1345.7235 1348.9986 1375.7273 1376.6076 1387.1936 1388.9174 1392.4399 1401.2000 1441.0919 1449.0066 1451.7747 1460.5964 1468.2661 1469.2143 1469.8004 1472.0213 1476.2642 1478.0180 1479.7197 1481.3570 1487.3311 1493.8066 1580.5271 1600.5708 1605.9562 1628.1941 1644.7360 2976.6334 2984.6851 2995.8772 3006.2933 3020.8603 3023.3380 3026.8813 3031.4933 3032.3276 3033.7785 3045.9805 3054.0448 3056.4449 3077.5757 3079.8974 3084.4237 3085.0464 3092.7384 3096.6863 3106.0015 3113.3889 3123.4985 3125.9905 3135.6998 3142.8959 3150.0448 3159.6247 3167.1843 3175.8626 3180.4682
redmass: 4.7713 4.9530 4.2533 2.7067 2.6689 3.5358 3.7603 4.6535 3.9859 4.1575 3.2990 2.8992 2.5464 3.4551 4.2888 4.0867 1.1653 3.8205 2.1324 4.0008 4.2633 4.6940 2.9384 4.6794 2.4697 6.6318 4.5131 2.4344 2.7586 3.4424 3.0686 3.3809 3.8289 5.2205 4.2923 4.3945 4.8110 5.3962 6.3278 3.9091 5.8715 5.9816 5.9086 4.9593 4.4514 5.2662 4.4025 1.0837 2.9845 1.3595 1.4910 1.5663 1.2946 2.5923 1.9224 3.3351 2.7078 2.5878 2.1647 1.5009 3.7092 3.8839 2.4791 3.1195 2.1706 2.3517 1.9851 1.3919 1.4647 2.0448 1.5621 1.3769 2.1952 1.3272 3.7203 2.2277 2.0929 2.6044 2.8017 3.1322 3.8369 2.6757 2.3495 2.2918 2.3896 2.1185 2.1584 1.6077 1.3781 2.1767 1.0924 1.0973 1.6911 1.1258 1.5225 1.4555 2.1246 1.3229 2.6559 1.2157 1.5298 1.6385 1.2143 1.2770 1.4170 1.2696 1.3568 1.1299 1.3406 1.7025 1.2767 1.2607 1.3553 1.4162 1.4006 1.3679 1.3316 1.4103 7.1630 1.3758 9.5158 1.2059 2.4312 2.4647 1.0871 1.0809 2.2965 1.0867 1.1255 1.0715 1.0763 1.0753 1.0414 2.6985 1.0931 1.0910 6.5982 7.1089 7.1678 7.7389 10.3173 1.0594 1.0367 1.0595 1.0581 1.0616 1.0995 1.0629 1.0843 1.0614 1.0624 1.0751 1.1037 1.0750 1.1035 1.0991 1.0977 1.1009 1.0993 1.1024 1.1071 1.1068 1.0880 1.0896 1.1040 1.0896 1.0886 1.0947 1.0942 1.0988 1.1000
irintensity: 0.1673 1.1053 0.7497 0.8482 0.2977 1.4618 0.0291 1.2014 0.3911 3.6354 0.4911 0.3691 1.7986 4.8057 1.6455 0.6905 0.3916 4.7053 0.9305 0.3031 2.1157 4.6462 0.5520 0.5000 1.2117 1.5126 0.0846 0.7106 1.1178 2.1173 4.1806 3.6419 2.6576 1.6557 0.6777 3.7006 2.0033 1.8706 5.4484 1.6665 8.6422 8.9750 8.7155 4.1543 10.0766 0.8858 4.5552 10.5695 69.3908 32.1435 99.5368 6.7342 2.1426 9.8819 15.3165 16.2371 1.8755 8.4589 0.1428 0.7611 22.3534 35.5899 11.4028 6.4352 28.4296 3.8298 2.1315 1.0738 6.9973 21.6744 1.1988 3.5430 54.9965 0.4185 30.5821 3.1302 4.8678 17.2442 125.3697 136.4268 75.4660 16.3227 24.0393 16.9638 24.8206 1.6818 4.1394 0.4855 0.2256 25.6551 1.4219 4.4137 61.8178 0.5968 21.2104 0.5080 47.6759 5.7595 180.5870 0.5163 5.3047 70.2672 8.7961 4.2910 0.4783 7.0404 1.4284 5.8592 7.1116 6.7111 1.1557 1.0175 1.4118 1.6921 3.2102 4.6866 13.7554 9.0080 2.4223 6.0718 1.2269 7.0700 70.3613 27.2499 6.9583 4.8274 113.8636 1.5892 40.6797 7.4587 26.0133 3.2463 17.5063 12.4166 14.7658 34.0207 30.5680 13.3132 10.7597 24.2171 111.6305 18.9894 18.2848 20.1928 26.8610 14.0444 4.4611 14.0772 4.2469 6.7052 22.5748 2.7973 3.2767 5.5510 5.7340 9.6612 34.6403 32.5244 36.4803 4.7078 8.8277 7.0150 4.5523 5.9281 1.9933 7.6134 5.6849 12.5464 10.9601 5.7395 8.5103
temp: 298.150 k
press: 1.00000 atm
elementType: 8 8 8 7 6 6 6 6 6 6 6 6 6 6 6 6 6 6 6 6 6 6 6 6 6 6 6 6 6 1 1 1 1 1 1 1 1 1 1 1 1 1 1 1 1 1 1 1 1 1 1 1 1 1 1 1 1 1 1
symmnumber: 1
zpe: 1311761.4 jmol-1
zpe.correction: 0.499624 hartree
zpe.thermalcorrener: 0.525423 hartree
zpe.thermalcorrenthalpy: 0.526367 hartree
zpe.thermalcorrgfe: 0.442538 hartree
zpe.sumelectzpe: -1248.726542 hartree
zpe.sumelectthermal: -1248.700742 hartree
zpe.sumelectthermalent: -1248.699798 hartree
zpe.sumelectthermalfe: -1248.783627 hartree
dipole: -12.5943 -3.1465 0.1151
dipole: 12.9819
quadrupole: -95.8979 -135.1140 -160.6299
quadrupole: 5.2654 1.6456 -3.4457
quadrupole: 34.6494 -4.5668 -30.0826 5.2654 1.6456 -3.4457
hfenergy: -1249.2261651 hartree
pointgroup: C01 [X(C25H30N1O3)]
dipole: 4.9872227 -0.920778 -0.6050631 debye
polarizability: 298.0388236|25.8139462|287.1736433|-48.4217472|8.8667635|224.0666031 unknown
InChI: InChI=1S/C25H30NO3/c1-2-3-14-26-15-12-18(13-16-26)23(17-26)29-25(27)24-19-8-4-6-10-21(19)28-22-11-7-5-9-20(22)24/h4-11,18,23-24H,2-3,12-17H2,1H3
charge 1 multiplicity 1
59 atoms
O  0.502312 -1.822351 -0.834204
O  -0.54649 -1.74306 1.241795
O  -2.579616 1.312448 0.956663
N  3.548013 -0.58137 0.088924
C  2.744195 -2.697073 -1.222686
C  2.323573 -1.209032 0.772951
C  3.171757 -0.20813 -1.361239
C  4.66467 -1.647989 0.041176
C  1.719047 -2.315148 -0.135319
C  2.946499 -1.501204 -2.188666
C  4.088179 -2.98493 -0.500726
C  4.05092 0.647183 0.880157
C  3.141019 1.885893 0.843767
C  3.709493 2.992072 1.772117
C  -0.596585 -1.533825 0.014016
C  -1.732844 -0.866253 -0.785272
C  2.840097 4.266721 1.742001
C  -3.034912 -0.926992 -0.003252
C  -1.301291 0.584347 -1.029968
C  -3.371086 0.131713 0.87052
C  -1.701817 1.584669 -0.107665
C  -3.898352 -2.044826 -0.061041
C  -0.475759 0.962374 -2.116099
C  -4.511613 0.087708 1.694141
C  -1.250767 2.918655 -0.226835
C  -5.051953 -2.108367 0.748747
C  -0.031279 2.294694 -2.260975
C  -5.350724 -1.044002 1.633865
C  -0.409568 3.269178 -1.301675
H  2.397491 -3.585189 -1.773585
H  1.5939 -0.41221 0.972909
H  2.664139 -1.618777 1.73811
H  3.993775 0.412735 -1.75512
H  2.256481 0.401873 -1.305251
H  5.066393 -1.744281 1.063548
H  5.456042 -1.237575 -0.60784
H  1.434819 -3.179547 0.48902
H  3.806492 -1.705854 -2.849896
H  2.058093 -1.369679 -2.824718
H  4.806598 -3.433826 -1.206563
H  3.942975 -3.710908 0.318945
H  4.189859 0.299268 1.920698
H  5.046055 0.888669 0.46312
H  3.063536 2.289323 -0.182732
H  2.113747 1.645651 1.177835
H  3.769166 2.60956 2.810503
H  4.744724 3.241867 1.464695
H  -1.817039 -1.399553 -1.748854
H  1.805326 4.052674 2.067224
H  2.794532 4.697021 0.72461
H  3.251602 5.038528 2.414886
H  -3.659507 -2.873913 -0.738196
H  -0.197943 0.204124 -2.858288
H  -4.730427 0.932818 2.352804
H  -1.593927 3.659258 0.501463
H  -5.711854 -2.979657 0.695455
H  0.577905 2.581186 -3.1247
H  -6.241868 -1.090693 2.267866
H  -0.078004 4.3071 -1.411364
