program: Gaussian 09
title: 000208793
version: EM64L-G09RevD.01
frameworkgroup: C1[X(C9H13N3O3)]
method: RPBEPBE
basis: SDD
operation: Freq
keyword: #p
keyword: freq=noraman
keyword: PBEPBE/SDD
title: #p freq=noraman PBEPBE/SDD
converged: YES YES NO NO
title: Mulliken charges:
elementType: O O O N N N C C C C C C C C C H H H H H H H H H H H H H
charge: -0.204323 -0.280413 -0.278541 -0.381078 -0.440987 -0.071025 -0.034376 -0.666824 -0.665952 0.248922 0.061385 0.199905 -0.417940 0.345998 -0.771330 0.248988 0.214126 0.204867 0.234164 0.234413 0.213831 0.204752 0.359539 0.382603 0.293013 0.252808 0.260707 0.252767
chargesum: 0.00000
title: Mulliken charges with hydrogens summed into heavy atoms:
elementType: O O O N N N C C C C C C C C C
charge: -0.204323 -0.280413 -0.278541 -0.021539 -0.058383 -0.071025 0.214612 -0.013667 -0.012957 0.248922 0.061385 0.199905 -0.124927 0.345998 -0.005048
polarizability: 1.94403256e+02 3.27471401e+00 1.25472448e+02 3.81198371e-02 -1.36939581e-01 7.81205436e+01
1716.lowfreq: -87.3320 -20.9142 -7.1098 -0.0004 0.0007 0.0008 3.8830 4.0434 37.5454
frequency: -87.3238 -20.4316 37.4426 51.3150 69.0811 92.9858 137.3690 139.3857 179.5007 197.7595 223.8113 240.9087 259.7270 301.8058 342.5093 353.2628 408.5852 429.6055 450.0396 501.5176 593.2879 616.7570 617.7907 671.4533 689.4907 747.2967 781.4173 789.8708 814.8751 858.9653 869.1754 873.2425 892.3885 909.2868 920.5463 940.9307 983.7408 989.4210 1020.0229 1040.2505 1102.2162 1143.0470 1159.6318 1173.0537 1184.2729 1225.2348 1239.9877 1329.3017 1346.8600 1377.6152 1381.4253 1394.1973 1405.6029 1411.9129 1462.9534 1463.5810 1464.8868 1465.8978 1474.9841 1482.8129 1486.9477 1526.6704 1582.9260 1604.6137 1674.5104 2978.3603 2981.4524 2999.1710 3041.9504 3071.8431 3082.7188 3084.6915 3089.9791 3094.2954 3113.6598 3259.3451 3363.8527 3482.3218
redmass: 1.0339 3.0700 4.4186 6.9424 4.3668 4.3688 4.6190 6.5129 4.6635 1.0302 1.7132 1.8709 4.4620 5.8751 3.0473 4.1422 4.8362 3.3768 2.9553 5.9485 10.4299 5.7092 4.1613 4.6762 3.2273 2.8317 1.7771 1.1942 4.5646 3.9099 1.3740 6.3065 3.2628 4.0901 1.2341 1.3920 5.7292 1.8155 2.8723 1.4714 1.8340 2.3698 2.3679 2.1736 2.6168 2.9652 2.5677 1.3632 1.2643 1.2126 5.4008 1.2199 1.2448 3.2131 1.0436 1.0454 1.0509 1.1594 1.0679 1.1017 2.9230 1.9142 7.2081 4.6509 6.0329 1.0358 1.0366 1.0372 1.0865 1.0996 1.0984 1.0974 1.1005 1.1000 1.0990 1.1003 1.0809 1.0780
irintensity: 0.0019 0.8152 1.3396 1.4709 1.1505 1.0464 5.3454 11.3413 5.2425 0.0052 7.4280 0.1115 19.3926 0.7029 12.1223 17.1906 5.2562 1.0130 0.3074 0.0083 0.1708 7.6921 1.6151 5.8684 7.5274 24.8152 160.6983 46.7858 12.2099 41.5369 28.3852 10.3879 1.7533 3.6213 5.6468 0.1913 4.1296 2.7819 43.6279 7.5819 0.3099 20.2698 18.2183 70.3039 19.5463 86.4049 233.0578 3.0690 9.8072 19.7347 5.9457 27.0887 9.6946 172.8823 19.9094 0.0297 5.7299 86.2443 44.9653 2.5746 207.3078 479.0935 47.9013 43.7259 413.4035 22.4059 27.0724 9.2825 1.4249 2.1723 7.2462 77.6185 21.3992 42.3489 3.7778 4.9781 149.6284 62.7504
temp: 298.150 k
press: 1.00000 atm
elementType: 8 8 8 7 7 7 6 6 6 6 6 6 6 6 6 1 1 1 1 1 1 1 1 1 1 1 1 1
symmnumber: 1
zpe: 575676.6 jmol-1
zpe.correction: 0.219264 hartree
zpe.thermalcorrener: 0.233343 hartree
zpe.thermalcorrenthalpy: 0.234287 hartree
zpe.thermalcorrgfe: 0.177337 hartree
zpe.sumelectzpe: -739.551790 hartree
zpe.sumelectthermal: -739.537710 hartree
zpe.sumelectthermalent: -739.536766 hartree
zpe.sumelectthermalfe: -739.593717 hartree
dipole: -3.0578 -4.1747 0.0125
dipole: 5.1748
quadrupole: -61.2308 -99.4996 -88.7943
quadrupole: 1.8553 0.0254 0.0708
quadrupole: 21.9442 -16.3247 -5.6194 1.8553 0.0254 0.0708
hfenergy: -739.7710531 hartree
pointgroup: C01 [X(C9H13N3O3)]
dipole: -1.1984402 -0.0329424 -1.6455007 debye
polarizability: 194.3646341|-1.4286811|78.1780557|3.5066249|1.3376701|125.453558 unknown
InChI: InChI=1S/C9H13N3O3/c1-5(2)10-9(14)11-8(13)7-4-6(3)15-12-7/h4-5,10-11H,1-3H3
charge 0 multiplicity 1
28 atoms
O  -3.713278 -0.185284 1.242692
O  2.382347 -0.216296 2.477061
O  0.211788 -0.309649 -1.187478
N  2.613016 -0.298067 0.134251
N  0.465216 -0.240222 1.153291
N  -2.278007 -0.199016 1.447977
C  4.092365 -0.310671 0.110521
C  4.62451 0.934487 -0.63532
C  4.605827 -1.625667 -0.519672
C  1.905394 -0.250973 1.306462
C  -1.760117 -0.241729 0.192759
C  -0.280782 -0.267794 -0.01275
C  -2.771454 -0.256593 -0.824141
C  -3.977716 -0.220781 -0.143423
C  -5.42038 -0.211966 -0.534781
H  4.409402 -0.265452 1.167378
H  5.729407 0.944054 -0.624562
H  4.294586 0.936123 -1.691587
H  4.263665 1.861625 -0.157194
H  4.23643 -2.500246 0.043396
H  5.71059 -1.647934 -0.512885
H  4.269838 -1.720692 -1.569673
H  2.074811 -0.322877 -0.746508
H  -0.042074 -0.205542 2.046375
H  -2.598449 -0.289161 -1.895595
H  -5.68023 -1.117449 -1.110807
H  -6.058224 -0.176309 0.362984
H  -5.654882 0.66488 -1.163574
