program: Gaussian 09
title: 000208801
version: EM64L-G09RevD.01
frameworkgroup: C1[X(C14H15N3O)]
method: RPBEPBE
basis: SDD
operation: Freq
keyword: #p
keyword: freq=noraman
keyword: PBEPBE/SDD
title: #p freq=noraman PBEPBE/SDD
converged: YES YES NO NO
title: Mulliken charges:
elementType: O N N N C C C C C C C C C C C C C C H H H H H H H H H H H H H H H
charge: -0.273312 -0.197671 -0.265055 -0.062962 -0.064104 -0.416362 -0.412801 -0.404088 -0.414592 -0.380745 0.207683 0.140813 0.127004 0.095041 -0.326103 -0.362416 -0.256192 -0.209530 0.244407 0.207569 0.209849 0.255180 0.259684 0.212989 0.263225 0.228409 0.197908 0.209240 0.211996 0.265390 0.253436 0.229064 0.227049
chargesum: 0.00000
title: Mulliken charges with hydrogens summed into heavy atoms:
elementType: O N N N C C C C C C C C C C C C C C
charge: -0.273312 -0.197671 -0.265055 -0.062962 0.180302 0.001056 0.102064 0.072125 0.011725 0.040490 0.207683 0.140813 0.127004 0.095041 -0.060714 -0.108981 -0.027129 0.017518
polarizability: 2.70738817e+02 9.57633584e+00 1.76925580e+02 -8.74262988e+00 1.80001462e+00 9.23923448e+01
1716.lowfreq: -17.4634 -6.1333 0.0008 0.0009 0.0009 4.6893 23.1987 76.4762 95.9251
frequency: 3.7892 76.4389 95.9125 131.1157 145.4003 180.1119 224.3150 242.5854 281.3177 288.4315 310.4564 317.1665 379.1317 431.5539 438.0902 449.5360 476.4456 513.4835 536.8369 558.7151 605.1340 645.1494 650.5868 675.6158 686.7391 726.0749 775.1372 780.0478 788.9875 823.0255 847.0681 872.9732 882.6714 886.8202 903.3368 948.9008 969.5153 973.2177 987.3468 994.8812 1025.4676 1057.5487 1072.4947 1080.8678 1095.5207 1100.1366 1132.8792 1151.2335 1157.5538 1177.3671 1187.9445 1201.0518 1242.0188 1252.9556 1256.6109 1263.9068 1277.1244 1296.1790 1300.6085 1315.8624 1333.1561 1337.6258 1347.8937 1354.2637 1367.5441 1382.9246 1422.9295 1456.3055 1457.6528 1463.6723 1467.5294 1469.8713 1479.7144 1492.9468 1556.0675 1586.1871 1612.1542 1642.7353 2932.7376 2942.7438 2970.8110 2984.1169 2991.6563 3012.0020 3043.2620 3049.3686 3058.4705 3075.0587 3084.7639 3129.4581 3144.1320 3160.0100 3170.0911
redmass: 3.7015 3.9446 5.1454 3.2240 5.5047 3.4996 2.4572 3.8788 6.1849 5.5217 5.6620 1.8797 3.5566 3.5299 3.4547 3.2532 3.6981 3.2672 3.6470 7.1958 2.5947 4.4299 6.6101 6.8634 5.2317 6.2132 1.6750 3.3481 2.8453 1.4667 3.0407 3.4889 2.4077 1.5179 1.8793 2.4903 3.5793 1.3715 1.3635 1.3255 2.0292 3.0833 1.9445 2.1787 2.0779 2.5857 2.0254 1.7001 1.2795 1.7131 1.7201 1.2860 1.9903 2.3102 1.2971 1.6867 1.4902 2.3997 2.3506 1.3300 1.3920 1.4018 1.4970 1.4829 1.8286 6.6687 3.0368 1.2670 2.1770 1.0994 1.4563 1.6724 1.1214 1.1866 6.7513 10.9025 7.3387 9.3733 1.0840 1.0703 1.0650 1.0608 1.0610 1.0635 1.0960 1.1028 1.1025 1.0940 1.1019 1.0859 1.0896 1.0951 1.0998
irintensity: 0.2390 0.7182 6.3897 0.6134 0.1443 1.8292 3.5754 0.2690 5.5581 1.2385 1.8684 0.8707 3.5304 0.7939 1.3812 1.2002 0.7482 3.8328 8.4441 0.7498 1.8386 4.2572 6.1387 2.8578 21.2051 13.0939 73.7925 14.6335 4.6286 4.8499 14.8766 0.5324 5.5555 1.1355 11.1913 14.2994 5.2878 2.7948 4.8176 0.0096 10.5992 15.1801 3.6415 11.4692 5.2015 22.5768 1.3491 2.9854 2.4013 8.5120 12.4392 7.1388 0.5074 7.0438 21.3012 96.3094 38.4459 13.3239 9.0496 29.7438 14.2348 4.9486 53.0848 5.1880 7.8805 16.8964 35.4932 41.6777 137.2519 13.9338 3.4753 30.3422 14.7182 27.6068 2.9874 644.3577 521.2220 421.2724 42.4942 81.3789 41.9094 22.5718 30.3669 23.5368 61.7457 32.0687 69.2191 8.7076 16.8886 6.8918 6.0761 17.5653 26.2761
temp: 298.150 k
press: 1.00000 atm
elementType: 8 7 7 7 6 6 6 6 6 6 6 6 6 6 6 6 6 6 1 1 1 1 1 1 1 1 1 1 1 1 1 1 1
symmnumber: 1
zpe: 706569.8 jmol-1
zpe.correction: 0.269118 hartree
zpe.thermalcorrener: 0.283111 hartree
zpe.thermalcorrenthalpy: 0.284055 hartree
zpe.thermalcorrgfe: 0.226257 hartree
zpe.sumelectzpe: -780.718783 hartree
zpe.sumelectthermal: -780.704791 hartree
zpe.sumelectthermalent: -780.703846 hartree
zpe.sumelectthermalfe: -780.761644 hartree
dipole: 5.1761 -1.5580 -0.2118
dipole: 5.4096
quadrupole: -85.9690 -111.6584 -106.4477
quadrupole: 7.2652 -1.4382 -1.1038
quadrupole: 15.3894 -10.3001 -5.0893 7.2652 -1.4382 -1.1038
hfenergy: -780.987901 hartree
pointgroup: C01 [X(C14H15N3O1)]
dipole: 2.0351435 0.6221796 0.0268585 debye
polarizability: 271.1935638|-9.1096322|176.790169|3.1588425|2.9320406|92.0730091 unknown
InChI: InChI=1S/C14H15N3O/c18-13-11-6-1-2-7-12(11)15-14-16-8-4-3-5-10(16)9-17(13)14/h1-2,6-7,10H,3-5,8-9H2
charge 0 multiplicity 1
33 atoms
O  -1.359502 -2.795529 -0.086374
N  1.850913 0.441252 0.282892
N  0.177468 -1.055757 0.11459
N  -0.398699 1.304425 0.184815
C  2.545034 -0.869446 0.347869
C  3.711012 -0.898268 -0.664026
C  1.39609 -1.896805 0.082793
C  2.601365 1.694301 0.359918
C  4.606559 0.35518 -0.487388
C  3.781398 1.6593 -0.639933
C  0.484129 0.316202 0.196323
C  -1.140034 -1.548472 0.003507
C  -2.154935 -0.470357 -0.001106
C  -1.746784 0.909584 0.07997
C  -3.529986 -0.805449 -0.096787
C  -2.752668 1.917593 0.057433
C  -4.507255 0.203318 -0.114753
C  -4.109885 1.568233 -0.038114
H  2.960057 -1.008402 1.370262
H  3.29517 -0.916617 -1.690775
H  4.300966 -1.824326 -0.525058
H  1.493329 -2.383538 -0.904872
H  1.334546 -2.687408 0.847388
H  2.989843 1.839024 1.391544
H  1.898656 2.516908 0.144904
H  5.428695 0.336385 -1.226264
H  5.07904 0.332666 0.516949
H  4.425209 2.543328 -0.473756
H  3.384373 1.725291 -1.671342
H  -3.796236 -1.866305 -0.157176
H  -2.432088 2.962013 0.118803
H  -5.568402 -0.056504 -0.188286
H  -4.871177 2.356679 -0.053452
