program: Gaussian 09
title: 000208786
version: EM64L-G09RevD.01
frameworkgroup: C1[X(C13H19N3O)]
method: RPBEPBE
basis: SDD
operation: Freq
keyword: #p
keyword: freq=noraman
keyword: PBEPBE/SDD
title: #p freq=noraman PBEPBE/SDD
converged: YES YES NO NO
title: Mulliken charges:
elementType: O N N N C C C C C C C C C C C C C H H H H H H H H H H H H H H H H H H H
charge: -0.258223 -0.152124 -0.470940 -0.074226 -0.388686 -0.397075 -0.377928 -0.364197 -0.403847 0.311842 -0.522856 -0.398697 -0.416946 0.027165 -0.491590 0.218193 -0.063025 0.199820 0.301052 0.181282 0.221455 0.206605 0.215557 0.208505 0.201890 0.225215 0.191638 0.218126 0.236190 0.213641 0.209149 0.204490 0.211107 0.253238 0.228509 0.295690
chargesum: 0.00000
title: Mulliken charges with hydrogens summed into heavy atoms:
elementType: O N N N C C C C C C C C C C C C C
charge: -0.258223 -0.152124 -0.175250 -0.074226 0.112187 0.005661 0.044234 0.046198 0.013006 0.311842 -0.068540 0.024093 -0.001349 0.027165 -0.009843 0.218193 -0.063025
polarizability: 2.21955121e+02 1.17419913e+01 1.69345895e+02 5.60610374e+00 3.93519837e+00 1.05944381e+02
1716.lowfreq: -33.3958 -9.5845 -5.6225 -0.0007 0.0004 0.0005 7.6439 16.4267 59.1039
frequency: -23.5242 10.6666 59.1020 98.8741 117.3408 159.0648 168.6343 207.1620 242.5556 272.7187 279.2426 291.8288 320.9792 376.2608 385.8186 435.4760 441.3230 457.5020 493.1257 511.1346 515.1722 529.8569 560.6973 602.7543 651.8099 683.3492 709.5403 747.5576 799.3710 810.4116 824.8003 839.4709 844.6060 863.9628 898.6656 904.0619 917.0451 944.2719 954.9857 978.4844 1006.0458 1037.7607 1073.9533 1082.4280 1092.1065 1100.3233 1123.8025 1126.3560 1133.4238 1151.1525 1162.7573 1174.4739 1201.9059 1233.2223 1239.9855 1246.1145 1255.5168 1271.4134 1277.2117 1284.6586 1328.9876 1334.5464 1336.6505 1341.6704 1342.6412 1347.6215 1351.1794 1358.8346 1362.2997 1424.7263 1432.4515 1453.4244 1455.0008 1459.8729 1463.8169 1466.9306 1469.2733 1470.2052 1474.6739 1481.1994 1547.7912 1595.1592 1668.7310 2946.0298 2950.0360 2952.3749 2969.1897 2974.3553 2979.9502 2984.7355 2985.0740 2992.2862 3003.4394 3038.3245 3039.3961 3044.8287 3047.4794 3054.1902 3055.4383 3059.7881 3089.2241 3553.7572
redmass: 3.2531 3.4897 3.7024 2.9919 3.5108 4.9747 3.2254 2.4901 2.3259 4.1458 2.2834 4.0901 2.1517 2.9437 1.9040 2.9433 3.2933 3.6885 2.2526 1.3668 3.4717 3.5461 3.5808 3.2125 3.5403 10.5845 4.1223 5.4655 1.6333 3.0163 1.5999 2.6147 1.5828 2.7118 2.5511 1.5128 2.6250 1.3357 3.4380 2.3834 2.6011 2.2653 2.2928 1.8422 1.8521 1.9837 2.2233 2.6921 1.1658 1.2548 1.4545 2.2162 2.8280 1.5537 1.4925 1.5168 1.3676 1.4642 1.5689 1.3870 1.2658 1.3956 1.3577 1.4539 1.5013 1.4473 1.6865 1.6611 1.3985 3.4830 4.7355 1.1123 1.1035 1.0845 1.0864 1.0843 1.0916 1.1028 1.0939 1.1193 5.7102 5.3606 6.9086 1.0694 1.0696 1.0590 1.0641 1.0683 1.0623 1.0607 1.0694 1.0613 1.0916 1.0922 1.0962 1.0992 1.0997 1.1039 1.0962 1.1013 1.0937 1.0764
irintensity: 1.8030 1.1626 0.1453 1.8467 1.3851 0.8712 2.3967 1.6371 1.0644 8.5255 0.7521 3.3668 3.4383 0.5197 1.9341 0.7202 0.5800 0.4695 3.8726 70.5640 2.3834 3.1697 0.4031 1.4497 2.4799 3.6273 3.4237 8.0434 1.0717 6.3953 4.0829 2.9042 18.0930 23.8352 10.6176 2.8508 4.5338 5.6829 41.8444 11.0345 12.0828 25.1509 4.6393 1.1039 4.5755 0.5492 6.8841 3.2920 3.1613 0.5743 7.8365 0.7308 3.7624 33.0158 10.3115 20.0330 7.2995 115.2502 97.0741 54.4672 2.2058 3.0755 3.6080 2.7548 14.1968 3.9383 0.2036 6.2755 9.3713 64.7525 77.7419 11.5838 1.4954 9.3766 12.7437 27.8412 11.0189 11.6975 8.6557 13.8017 928.0104 431.3780 113.6188 30.4549 81.5142 45.5499 44.6477 16.4151 40.0571 26.4380 21.7367 28.3270 43.6651 27.5872 62.7819 54.4260 52.0396 61.3702 7.2909 111.9866 8.6465 16.6082
temp: 298.150 k
press: 1.00000 atm
elementType: 8 7 7 7 6 6 6 6 6 6 6 6 6 6 6 6 6 1 1 1 1 1 1 1 1 1 1 1 1 1 1 1 1 1 1 1
symmnumber: 1
zpe: 806713.0 jmol-1
zpe.correction: 0.307261 hartree
zpe.thermalcorrener: 0.321678 hartree
zpe.thermalcorrenthalpy: 0.322622 hartree
zpe.thermalcorrgfe: 0.264890 hartree
zpe.sumelectzpe: -744.990599 hartree
zpe.sumelectthermal: -744.976183 hartree
zpe.sumelectthermalent: -744.975238 hartree
zpe.sumelectthermalfe: -745.032970 hartree
dipole: -2.8898 -8.5223 -0.5649
dipole: 9.0167
quadrupole: -85.3056 -114.2086 -101.2483
quadrupole: -7.4458 0.7984 0.2471
quadrupole: 14.9485 -13.9544 -0.9941 -7.4458 0.7984 0.2471
hfenergy: -745.2978602 hartree
pointgroup: C01 [X(C13H19N3O1)]
dipole: -1.2156502 3.2143489 0.8800289 debye
polarizability: 222.3523909|-8.836242|164.9196656|-8.9063547|15.6184952|109.9733409 unknown
InChI: InChI=1S/C13H19N3O/c17-12-10-6-2-3-7-11(10)14-13(15-12)16-8-4-1-5-9-16/h14H,1-9H2
charge 0 multiplicity 1
36 atoms
O  1.626125 -2.693858 -0.812985
N  -2.02017 0.010155 0.396041
N  0.189844 0.936799 0.354797
N  -0.197887 -1.352865 -0.210134
C  -2.93344 -1.150261 0.250473
C  -2.6924 1.27108 0.764075
C  -4.045018 -0.848027 -0.778038
C  -3.803078 1.627847 -0.256129
C  -4.797221 0.453602 -0.414806
C  1.577814 0.813465 0.139463
C  2.405615 2.064159 0.367632
C  3.812819 1.926462 -0.260351
C  4.432693 0.552657 0.08715
C  2.096616 -0.400066 -0.247755
C  3.578838 -0.599957 -0.48727
C  -0.659398 -0.162111 0.170614
C  1.182913 -1.559361 -0.445318
H  -3.387582 -1.367656 1.241353
H  -2.313797 -2.009069 -0.050192
H  -1.978868 2.110127 0.833892
H  -3.146612 1.153747 1.772026
H  -4.744913 -1.704189 -0.813777
H  -3.588829 -0.753247 -1.782336
H  -3.334641 1.854021 -1.233806
H  -4.32736 2.541741 0.084262
H  -5.55339 0.695622 -1.184688
H  -5.345113 0.306982 0.539474
H  1.884025 2.94699 -0.056898
H  2.501542 2.247033 1.458656
H  3.735641 2.023591 -1.361046
H  4.458926 2.750197 0.096757
H  4.501093 0.453529 1.189335
H  5.464655 0.490921 -0.306415
H  3.873365 -1.574764 -0.056695
H  3.753666 -0.704218 -1.577723
H  -0.171276 1.84152 0.655161
