program: Gaussian 09
title: 000208809
version: EM64L-G09RevD.01
frameworkgroup: C1[X(C19H23N3O2)]
method: RPBEPBE
basis: SDD
operation: Freq
keyword: #p
keyword: freq=noraman
keyword: PBEPBE/SDD
title: #p freq=noraman PBEPBE/SDD
converged: YES YES NO NO
title: Mulliken charges:
elementType: O O N N N C C C C C C C C C C C C C C C C C C C H H H H H H H H H H H H H H H H H H H H H H H
charge: -0.247851 -0.288115 -0.096609 -0.194270 -0.024811 -0.344940 0.333312 -0.579395 -0.378641 -0.350214 -0.338946 -0.152382 -0.601464 0.203689 0.365447 0.090945 -0.313025 -0.319441 0.115657 -0.377325 -0.428664 -0.826682 -0.246069 -0.234839 0.222303 0.220497 0.251025 0.244593 0.242284 0.240273 0.211516 0.191960 0.198842 0.221028 0.231580 0.231833 0.191136 0.212607 0.215177 0.191947 0.271800 0.236581 0.284619 0.231682 0.231949 0.230726 0.228677
chargesum: 0.00000
title: Mulliken charges with hydrogens summed into heavy atoms:
elementType: O O N N N C C C C C C C C C C C C C C C C C C C
charge: -0.247851 -0.288115 -0.096609 -0.194270 -0.024811 0.097860 0.333312 -0.096838 0.116977 0.053262 0.080924 -0.152382 -0.138051 0.203689 0.365447 0.090945 0.090718 0.087682 0.115657 -0.105525 -0.192083 -0.078433 -0.015343 -0.006162
polarizability: 3.22106748e+02 -3.55732343e+01 2.65048176e+02 2.20151602e+01 1.10318440e+01 1.45442498e+02
1716.lowfreq: -14.6955 -4.2738 -0.0008 -0.0006 -0.0001 1.3057 9.9789 11.5002 28.4641
frequency: -10.7949 10.4634 28.4322 54.0771 69.9817 87.1396 93.5325 97.4151 122.3348 149.9844 174.1265 200.1960 220.7248 238.9717 260.5064 282.1068 299.2621 312.4472 335.5192 342.7642 358.5434 380.7852 401.6667 405.4704 428.0990 457.7197 468.9700 470.2538 477.5063 506.6990 527.1200 554.1390 571.2190 609.9984 628.6499 637.8987 674.9869 703.4198 744.2287 750.7570 756.8702 769.1282 784.1965 788.0470 806.1853 829.4992 840.2182 883.2973 884.6319 896.3515 948.3462 960.6321 967.6839 989.4454 995.2230 998.2697 1022.1284 1026.6743 1034.6266 1038.1983 1044.1966 1045.3310 1053.6702 1076.7784 1086.6912 1101.3442 1113.2005 1119.1495 1136.9933 1162.5897 1166.4550 1173.5984 1189.7821 1194.8836 1209.4770 1219.5782 1242.4473 1261.7648 1271.6081 1283.2957 1287.7378 1294.4721 1295.9191 1309.9793 1313.5663 1326.4520 1334.1361 1349.7796 1357.7813 1366.3258 1370.7129 1371.8305 1384.4823 1389.8667 1391.5682 1432.8485 1443.0520 1444.4991 1448.9721 1450.4954 1452.1515 1456.2553 1461.2006 1461.4691 1479.8643 1481.9957 1484.8507 1495.0606 1557.7746 1585.4665 1605.7999 1618.4710 2868.0871 2877.2200 2899.0978 2953.8103 2958.2233 2962.7749 2971.0148 2978.5758 3028.4880 3036.5260 3044.7427 3044.9074 3052.9735 3054.6548 3059.7645 3079.8050 3084.2908 3106.2016 3119.4092 3129.0437 3135.6013 3153.4876 3169.0768
redmass: 3.3016 4.8761 4.4297 4.2236 4.4341 3.6573 4.1950 1.0971 4.7075 3.2018 3.6839 2.9675 3.7981 1.8706 3.2966 2.8057 3.2955 2.5417 3.7462 3.7757 4.2031 3.0884 2.6055 4.0707 3.7947 3.9425 3.5860 3.1535 4.3106 4.8267 4.4420 4.4193 3.8764 2.3812 3.2909 5.6617 5.5103 4.1011 3.4830 2.4947 3.7087 2.1092 2.1339 2.0702 3.6051 2.5967 1.6078 2.4680 1.3669 2.3745 3.6486 1.5651 3.1209 2.0196 1.3357 2.7034 1.9045 2.2130 2.1571 2.2090 3.7740 1.9507 1.9581 2.6223 3.2997 2.2473 2.0130 2.5008 2.5946 1.4404 1.8418 1.0669 1.2175 1.7216 1.9048 1.6587 1.4534 2.4350 1.2940 2.4874 1.4294 1.6635 1.6335 1.4564 1.5230 1.3256 1.2384 1.3154 1.7628 1.4153 1.3600 2.9354 5.4381 1.4323 1.2601 1.4357 1.0831 1.8186 1.1021 1.1534 1.1001 1.2535 1.1218 1.1024 1.1179 2.1197 1.0854 3.5301 8.7270 7.0694 7.9998 7.5221 1.0700 1.0699 1.0689 1.0664 1.0666 1.0690 1.0633 1.0387 1.0905 1.0906 1.0952 1.0891 1.0957 1.0589 1.0946 1.0965 1.0976 1.0978 1.0871 1.1069 1.0893 1.0946 1.0987
irintensity: 0.0305 0.1055 0.3974 1.1076 0.2593 1.1289 2.7947 0.3119 2.8728 0.5971 2.9871 6.6808 0.9133 1.4803 2.3442 1.6494 1.7890 8.7526 7.8424 1.4682 8.2072 6.1384 1.5769 1.4901 2.7112 19.5540 2.2690 4.8208 1.8684 3.2578 3.9428 1.8280 7.1268 15.7657 1.6174 1.4570 13.5350 18.4709 10.7098 11.9950 1.2613 14.7382 45.2160 5.4003 18.6174 12.1868 0.4814 22.9040 0.0802 6.8596 14.8202 3.6330 3.2062 19.0131 0.6692 20.6227 15.7842 8.5285 38.3738 4.0904 19.4418 4.8932 9.4110 3.3099 28.3471 7.9176 18.9782 28.2849 97.7540 9.2143 10.5128 2.4364 2.7445 18.2237 0.7620 3.5121 10.0274 10.2300 5.3687 18.7573 37.5649 1.9789 1.7315 4.0246 11.3521 8.7781 2.7979 6.0198 2.0389 5.9034 7.2374 1.0954 1.7427 4.5692 47.8754 22.6811 2.4834 25.0007 0.4730 21.2291 12.0101 7.4502 8.5779 16.0819 11.7817 1.5913 12.3483 14.8775 235.1423 5.5120 95.4318 46.8249 58.5008 72.9701 80.8367 35.2868 106.0388 17.3999 26.9743 18.0196 25.7341 26.8459 36.5655 22.7174 24.1244 23.5438 17.2229 41.4066 37.2087 3.0445 7.4523 3.0110 12.9435 25.9130 21.5746
temp: 298.150 k
press: 1.00000 atm
elementType: 8 8 7 7 7 6 6 6 6 6 6 6 6 6 6 6 6 6 6 6 6 6 6 6 1 1 1 1 1 1 1 1 1 1 1 1 1 1 1 1 1 1 1 1 1 1 1
symmnumber: 1
zpe: 1021510.5 jmol-1
zpe.correction: 0.389073 hartree
zpe.thermalcorrener: 0.409559 hartree
zpe.thermalcorrenthalpy: 0.410503 hartree
zpe.thermalcorrgfe: 0.338402 hartree
zpe.sumelectzpe: -1050.737812 hartree
zpe.sumelectthermal: -1050.717326 hartree
zpe.sumelectthermalent: -1050.716382 hartree
zpe.sumelectthermalfe: -1050.788483 hartree
dipole: 5.0626 -0.7677 0.7347
dipole: 5.1730
quadrupole: -145.3109 -137.0383 -141.3605
quadrupole: 7.2762 6.8976 2.1854
quadrupole: -4.0743 4.1983 -0.1240 7.2762 6.8976 2.1854
hfenergy: -1051.1268845 hartree
pointgroup: C01 [X(C19H23N3O2)]
dipole: 1.9873025 -0.4026938 0.1746125 debye
polarizability: 320.7007974|-39.6164773|260.2343205|11.5182706|31.0147678|151.6623049 unknown
InChI: InChI=1S/C19H23N3O2/c1-14-16-7-6-15-4-2-3-5-17(15)18(16)20-22(19(14)23)9-8-21-10-12-24-13-11-21/h2-5H,6-13H2,1H3
charge 0 multiplicity 1
47 atoms
O  -6.787998 -0.685618 0.461849
O  -1.152633 2.867097 0.104294
N  -3.916881 -0.508568 0.065794
N  -0.379805 0.737388 -0.495967
N  0.572143 -0.242627 -0.618197
C  -2.493397 -0.267457 0.384295
C  2.209021 1.398474 0.195011
C  3.677219 1.653615 0.490948
C  -1.756534 0.322155 -0.843825
C  -4.519234 -1.627074 0.83582
C  -4.753704 0.714484 0.196745
C  1.837664 0.07654 -0.279851
C  4.36582 0.40008 1.081227
C  2.86382 -0.983979 -0.431696
C  4.124402 -0.828802 0.217547
C  1.229616 2.379513 0.321084
C  -5.949291 -1.88881 0.333001
C  -6.18083 0.42457 -0.293565
C  -0.168037 2.062943 -0.006768
C  2.607467 -2.151137 -1.198605
C  5.104308 -1.837784 0.072967
C  1.506081 3.791235 0.785772
C  3.589299 -3.152567 -1.327343
C  4.845474 -2.996484 -0.69226
H  -2.016732 -1.228955 0.650774
H  -2.36662 0.424065 1.251316
H  -2.284477 1.217564 -1.207017
H  -1.69221 -0.431107 -1.643064
H  4.185649 1.932174 -0.455955
H  3.789185 2.51165 1.176196
H  -3.906699 -2.536862 0.689718
H  -4.555096 -1.40442 1.931962
H  -4.792393 1.061065 1.259704
H  -4.314932 1.532073 -0.40322
H  3.964749 0.218112 2.10004
H  5.449561 0.583483 1.195763
H  -5.912721 -2.207832 -0.731285
H  -6.449582 -2.663538 0.937513
H  -6.843176 1.289948 -0.126616
H  -6.158239 0.172021 -1.375661
H  1.633207 -2.253266 -1.685746
H  6.075482 -1.715064 0.567752
H  0.581169 4.385077 0.71469
H  2.291121 4.275001 0.176236
H  1.846874 3.812457 1.83886
H  3.383092 -4.047652 -1.924263
H  5.615895 -3.768482 -0.796978
