program: Gaussian 09
title: 000208765
version: EM64L-G09RevD.01
frameworkgroup: C1[X(C6H8N4O2)]
method: RPBEPBE
basis: SDD
operation: Freq
keyword: #pfreq=noraman
keyword: PBEPBE/SDD
title: #p freq=noraman PBEPBE/SDD
converged: YES YES NO NO
title: Mulliken charges:
elementType: O O N N N N C C C C C C H H H H H H H H
charge: -0.218456 -0.307466 -0.010854 -0.201679 -0.612217 -0.631839 0.348117 0.072954 -0.457557 -0.773650 0.089511 0.296085 0.285639 0.240607 0.251730 0.251778 0.347595 0.315301 0.407255 0.307144
chargesum: 0.00000
title: Mulliken charges with hydrogens summed into heavy atoms:
elementType: O O N N N N C C C C C C
charge: -0.218456 -0.307466 -0.010854 -0.201679 0.050679 0.082560 0.348117 0.072954 -0.171918 -0.029534 0.089511 0.296085
polarizability: 1.65111416e+02 -2.89613069e+00 1.04938910e+02 3.99125841e-03 5.27779775e-03 4.81348394e+01
1716.lowfreq: -6.6979 -0.0005 0.0006 0.0007 2.6900 8.3601 41.7044 66.1188 89.0789
frequency: 41.6229 66.1122 89.0443 101.2506 138.6754 190.0652 254.5474 297.5120 298.0973 342.9400 356.9914 410.5842 493.9130 506.8419 507.9366 566.6491 588.8726 622.3324 660.1209 707.3874 766.5777 803.5153 833.3486 867.5694 886.6708 903.5109 920.0141 985.4457 994.5150 1034.7734 1050.5744 1079.3828 1113.2989 1208.5388 1286.0695 1374.5602 1401.3508 1408.7484 1438.0318 1457.3833 1470.0923 1515.8746 1540.7505 1599.0823 1601.2405 1638.7884 2993.0691 3073.4530 3110.7635 3187.1226 3267.2178 3550.7099 3606.6569 3705.6846
redmass: 5.4871 3.9133 1.1157 4.4864 5.0960 4.5659 3.8727 4.7416 3.9654 1.1920 4.4697 5.0810 5.0773 3.1662 1.2030 1.1710 7.7883 4.3874 4.5184 6.8703 5.3029 8.5866 8.0201 1.3861 1.1301 5.5254 5.2297 4.5109 1.7136 1.6301 1.4922 1.7955 1.8418 3.7189 4.2750 8.4265 1.9178 1.9043 3.3496 1.0426 1.1247 3.3501 3.3969 2.8913 2.4119 1.6507 1.0373 1.0981 1.0986 1.0668 1.0997 1.0454 1.0875 1.1052
irintensity: 1.0195 5.7359 0.0257 4.9366 0.9508 7.5091 0.7483 2.4384 3.2846 27.6096 2.3652 9.0768 5.5593 0.8158 394.2165 24.5560 2.2586 8.1554 1.2189 0.8191 2.6886 111.4390 1.8534 27.7496 179.6561 3.6667 11.9858 3.5001 15.7051 6.9744 9.0431 17.4012 7.0453 29.8585 171.8777 112.6988 182.9466 138.0808 55.8726 16.3906 11.0442 282.6823 195.0507 280.9268 72.9417 651.4812 19.4187 10.8953 10.4155 183.2474 2.5406 71.2673 43.0115 39.2665
temp: 298.150 k
press: 1.00000 atm
elementType: 8 8 7 7 7 7 6 6 6 6 6 6 1 1 1 1 1 1 1 1
symmnumber: 1
zpe: 388283.2 jmol-1
zpe.correction: 0.147889 hartree
zpe.thermalcorrener: 0.159583 hartree
zpe.thermalcorrenthalpy: 0.160528 hartree
zpe.thermalcorrgfe: 0.109391 hartree
zpe.sumelectzpe: -601.981781 hartree
zpe.sumelectthermal: -601.970087 hartree
zpe.sumelectthermalent: -601.969142 hartree
zpe.sumelectthermalfe: -602.020279 hartree
dipole: -4.7650 6.5554 0.0077
dipole: 8.1042
quadrupole: -32.7511 -71.3780 -72.1712
quadrupole: 2.3926 0.0169 -0.0072
quadrupole: 26.0157 -12.6112 -13.4045 2.3926 0.0169 -0.0072
hfenergy: -602.12967 hartree
pointgroup: C01 [X(C6H8N4O2)]
dipole: -2.0131462 -2.3416129 -0.7939091 debye
dipolederiv: -0.8653289 -0.0647708 0.0659301 0.1471663 -0.2834839 -0.085526 0.1625907 -0.0580155 -0.1841468 -0.8022498 0.1934306 0.1482087 -0.1641852 -0.9198969 -0.2406957 -0.0126142 -0.2873359 -0.4628677 0.421987 -0.0013943 -0.0762412 0.1639889 -0.1771031 -0.0310907 -0.0019343 -0.0093562 -0.1602724 -2.1648649 -0.644593 -0.0472283 -0.5805657 -0.7610215 -0.1226428 -0.0187682 -0.1146027 -0.366831 -0.7673189 -0.4871468 -0.2100528 -0.5904028 -1.0085326 -0.0583721 -0.2564426 -0.071736 -0.7047875 -0.9299625 0.2389757 0.1475716 0.3456667 -0.7497943 -0.104198 0.1951343 -0.0901511 -0.6842981 0.614827 -0.070206 -0.1082078 -0.0689435 0.2889662 0.1244605 -0.1104286 0.1254623 0.1049917 -0.3059006 -0.0269956 0.0368616 -0.3134988 0.1403203 0.0734562 -0.0927634 0.0356832 0.0980165 -0.4910418 0.1401799 0.1026601 0.0890792 -0.1494879 0.008056 0.0800234 0.0012008 -0.202456 -0.1212703 0.1052996 0.0729049 0.0336156 0.004937 -0.0359439 0.0438918 -0.0467805 0.0475808 1.8666486 0.1502699 -0.1549008 0.6693329 1.1363075 0.3440156 0.0786736 0.4122404 0.3482128 2.3642201 0.577747 -0.0116729 0.1654028 1.2997423 0.4297983 -0.1965349 0.3759398 0.4876996 0.1705471 -0.0491546 -0.0190541 -0.0474804 0.0578609 -0.0561225 -0.0184031 -0.0557773 0.1727474 0.0569964 -0.0752899 -0.0234173 0.0020921 -0.0609743 -0.082974 0.0101418 -0.0724797 0.093568 0.0260421 -0.0066359 0.0801401 -0.0302237 0.038136 0.0878673 0.1203898 0.0492728 0.000708 -0.0240927 0.0523227 -0.065151 0.0571526 0.0982907 -0.0159222 -0.1138917 0.0207522 -0.0068324 0.1863747 0.0059795 0.0289539 0.0445144 0.2891721 -0.0501254 0.0461425 -0.0451395 0.361516 0.1637647 0.027308 0.0417796 0.0263522 0.2250377 -0.0777249 0.0412713 -0.0779489 0.3503492 0.5126251 -0.0274855 -0.0323112 0.1026127 0.2908016 -0.0444332 0.0262183 -0.0273936 0.3439938 0.0879975 -0.0378406 0.0232269 -0.0516762 0.2407222 -0.0618826 0.0173035 -0.0638345 0.3631081 unknown
polarizability: 163.5825469|5.0010737|95.4523022|-12.9236243|20.6697767|59.1503165 unknown
InChI: InChI=1S/C6H8N4O2/c1-3-2-4(10-12-3)5(11)9-6(7)8/h2H,7-8H2,1H3
charge 0 multiplicity 1
20 atoms
O  2.993065 0.559343 0.249402
O  -1.07869 1.443156 1.177855
N  1.712018 1.124947 0.673567
N  -1.417546 -0.734825 0.245191
N  -3.457602 -1.816321 0.026346
N  -3.438535 0.347341 0.994421
C  2.77502 -0.720017 -0.301491
C  0.807941 0.158838 0.354473
C  1.422346 -0.996846 -0.249492
C  3.985478 -1.447361 -0.789853
C  -0.647043 0.355463 0.633562
C  -2.760715 -0.701696 0.435282
H  0.894577 -1.884511 -0.582297
H  3.700051 -2.435056 -1.185594
H  4.492849 -0.882192 -1.592482
H  4.71658 -1.594823 0.025355
H  -2.910899 -2.57016 -0.383144
H  -4.46604 -1.906071 0.117341
H  -2.82437 1.142572 1.270267
H  -4.448086 0.349417 1.12829
