program: Gaussian 09
title: 000208781
version: EM64L-G09RevD.01
frameworkgroup: C1[X(C13H20N4O)]
method: RPBEPBE
basis: SDD
operation: Freq
keyword: #p
keyword: freq=noraman
keyword: PBEPBE/SDD
title: #p freq=noraman PBEPBE/SDD
converged: YES YES NO NO
title: Mulliken charges:
elementType: O N N N N C C C C C C C C C C C C C H H H H H H H H H H H H H H H H H H H H
charge: -0.257350 -0.165312 -0.065032 -0.473485 -0.072886 -0.368696 -0.381306 -0.376152 -0.348480 0.313766 -0.523131 -0.399119 -0.416710 -0.492607 0.025811 0.215387 -0.061081 -0.614372 0.290495 0.215786 0.234888 0.176368 0.219843 0.202449 0.186483 0.215115 0.236039 0.219206 0.209586 0.213797 0.211317 0.204760 0.228092 0.254227 0.298522 0.228955 0.222560 0.192265
chargesum: 0.00000
title: Mulliken charges with hydrogens summed into heavy atoms:
elementType: O N N N N C C C C C C C C C C C C C
charge: -0.257350 -0.165312 -0.065032 -0.174963 -0.072886 0.137585 0.029951 0.046140 0.053118 0.313766 -0.067886 0.024263 -0.000633 -0.010288 0.025811 0.215387 -0.061081 0.029408
polarizability: 2.36241836e+02 -1.07231729e+01 1.75400583e+02 -6.78963652e+00 4.90958150e+00 1.12213731e+02
1716.lowfreq: -24.2751 -4.8143 -0.0003 0.0003 0.0003 6.0936 13.2282 36.4010 58.7125
frequency: -17.0280 35.8569 58.6600 99.1552 110.5152 144.9744 166.7045 173.3488 204.7891 230.2696 259.8622 272.1248 285.4820 294.1584 325.1233 328.4419 388.1709 403.6907 440.6647 455.3099 469.4901 501.3241 514.6232 517.1211 542.9287 571.7921 616.6679 652.9882 684.0161 710.5076 745.5773 750.0874 824.9148 829.0803 837.6332 859.6519 904.0977 911.5363 932.3065 957.0358 978.3216 1000.0538 1034.0384 1046.2810 1064.8475 1074.2491 1081.9207 1092.5794 1099.5277 1123.5095 1133.0516 1146.8351 1149.7315 1164.3953 1176.5586 1199.7231 1203.1103 1234.7433 1241.1669 1247.2153 1269.7192 1281.7469 1291.0862 1295.0575 1333.9636 1335.5762 1341.3719 1348.3669 1351.5098 1359.0440 1364.6506 1372.8219 1425.7154 1430.9996 1435.3922 1452.0521 1453.8821 1455.3796 1460.4892 1461.4337 1463.8959 1470.2564 1473.3236 1475.9872 1481.4310 1548.5948 1596.6913 1667.6234 2838.8122 2861.2832 2874.5469 2952.0610 2969.5916 2973.7566 2979.3883 2980.8806 2985.6560 3003.7756 3022.0175 3027.4505 3039.4565 3040.8481 3045.5427 3054.8649 3060.2773 3079.7168 3094.4195 3551.7425
redmass: 3.9010 3.3392 3.4746 3.0239 3.6247 3.3924 5.7746 2.8105 1.7402 1.4674 3.3928 3.0462 3.1294 2.1716 2.4013 2.1466 2.8842 2.2559 3.6739 4.2165 2.7024 2.5046 2.6176 1.6895 5.7150 3.7279 2.4169 3.5454 10.2519 4.1652 4.1747 4.4046 1.7985 2.8913 1.6283 2.7671 1.5298 2.6211 2.1121 3.5840 2.3673 2.5144 2.8139 1.6899 1.7953 1.8782 1.8928 2.1379 2.2845 1.6411 1.1584 2.5982 2.7418 1.6222 2.1791 1.2088 2.4147 1.5460 1.7141 1.6671 1.8245 1.5351 1.5625 1.4573 1.3105 1.3564 1.4479 1.3558 1.6826 1.6883 1.4096 1.4233 3.1939 1.2577 3.7051 1.1024 1.0859 1.1058 1.0859 1.0800 1.1180 1.0984 1.1014 1.1013 1.0529 5.8498 5.4119 6.9274 1.0700 1.0630 1.0630 1.0591 1.0652 1.0683 1.0667 1.0625 1.0697 1.0911 1.0740 1.0886 1.0921 1.0903 1.0992 1.1039 1.0955 1.1009 1.0962 1.0766
irintensity: 1.5891 1.9217 0.0521 1.7754 1.6736 2.0883 2.4508 1.7791 1.2505 1.9058 1.5355 5.4176 3.5854 7.6813 9.9464 1.4768 2.3557 0.1549 0.9483 0.8022 0.6790 12.9296 27.4215 38.9666 3.0563 0.4161 3.2449 1.9475 4.8051 4.3908 0.2526 12.2708 6.6159 3.3471 0.0600 24.5463 3.5715 5.7433 0.3235 39.7823 10.3373 74.6130 5.4896 7.4022 12.5267 1.5029 3.2818 8.1674 1.9194 7.5282 3.2656 33.1942 10.0815 5.6789 4.4329 9.3342 4.9605 25.6512 5.8165 9.7167 129.2470 49.4628 59.2234 110.7687 1.7350 3.3945 2.7160 10.9285 0.3608 6.1934 3.7584 0.8511 54.3271 7.2321 81.5233 2.2543 8.1597 18.7725 7.3607 44.2445 21.7046 8.0663 13.3712 11.0634 9.5590 923.9711 432.9568 115.1092 62.9466 51.3926 174.7050 34.0383 44.9249 17.5688 64.7554 40.6750 18.2103 43.5796 47.3387 59.1130 23.7014 50.7181 53.4753 62.5677 45.1480 30.9419 10.2131 16.2261
temp: 298.150 k
press: 1.00000 atm
elementType: 8 7 7 7 7 6 6 6 6 6 6 6 6 6 6 6 6 6 1 1 1 1 1 1 1 1 1 1 1 1 1 1 1 1 1 1 1 1
symmnumber: 1
zpe: 847175.5 jmol-1
zpe.correction: 0.322672 hartree
zpe.thermalcorrener: 0.338422 hartree
zpe.thermalcorrenthalpy: 0.339366 hartree
zpe.thermalcorrgfe: 0.279960 hartree
zpe.sumelectzpe: -800.236560 hartree
zpe.sumelectthermal: -800.220810 hartree
zpe.sumelectthermalent: -800.219866 hartree
zpe.sumelectthermalfe: -800.279272 hartree
dipole: 2.6658 -8.3591 -0.1405
dipole: 8.7750
quadrupole: -93.8862 -118.2791 -108.0077
quadrupole: 11.5234 3.5481 -0.3581
quadrupole: 12.8381 -11.5548 -1.2834 11.5234 3.5481 -0.3581
hfenergy: -800.559232 hartree
pointgroup: C01 [X(C13H20N4O1)]
dipole: -1.1240276 -3.155429 0.8357876 debye
polarizability: 236.5335889|7.0275281|169.2311439|-10.2563233|-18.6522391|118.0914178 unknown
InChI: InChI=1S/C13H20N4O/c1-16-6-8-17(9-7-16)13-14-11-5-3-2-4-10(11)12(18)15-13/h14H,2-9H2,1H3
charge 0 multiplicity 1
38 atoms
O  1.983927 2.600101 -1.012159
N  -1.666278 0.058081 0.494275
N  -4.468858 -0.276872 -0.054172
N  0.520405 -0.915757 0.440885
N  0.155903 1.339276 -0.265138
C  -2.55228 1.238964 0.381492
C  -2.363983 -1.169891 0.913374
C  -3.744947 0.927778 -0.536796
C  -3.568262 -1.448158 -0.016316
C  1.901118 -0.839116 0.164086
C  2.713165 -2.088581 0.44971
C  4.103985 -2.021335 -0.225906
C  4.755341 -0.637478 0.002514
C  3.903261 0.484669 -0.631156
C  2.427678 0.334257 -0.324306
C  -0.312138 0.186305 0.209598
C  1.531713 1.500589 -0.559915
C  -5.70557 -0.54066 -0.815224
H  -1.943475 2.067127 -0.013442
H  -2.928293 1.502645 1.390541
H  -2.735298 -1.049945 1.951795
H  -1.698374 -2.05016 0.88748
H  -4.44208 1.785601 -0.52679
H  -3.376565 0.795128 -1.585533
H  -3.182037 -1.713113 -1.035643
H  -4.129536 -2.318737 0.372733
H  2.838157 -2.200801 1.547405
H  2.162773 -2.986579 0.100048
H  4.746929 -2.828434 0.172419
H  3.99344 -2.196714 -1.313959
H  5.776039 -0.623548 -0.423537
H  4.857121 -0.458936 1.091967
H  4.041197 0.499247 -1.731793
H  4.229787 1.48388 -0.288907
H  0.156426 -1.779324 0.842659
H  -6.367626 0.341518 -0.759185
H  -6.242143 -1.398372 -0.370994
H  -5.522422 -0.76675 -1.895811
