program: Gaussian 09
title: 000208806
version: EM64L-G09RevD.01
frameworkgroup: C1[X(C20H27N3O2)]
method: RPBEPBE
basis: SDD
operation: Freq
keyword: #p
keyword: freq=noraman
keyword: PBEPBE/SDD
title: #p freq=noraman PBEPBE/SDD
converged: YES YES NO NO
title: Mulliken charges:
elementType: O O N N N C C C C C C C C C C C C C C C C C C C C H H H H H H H H H H H H H H H H H H H H H H H H H H H
charge: -0.247388 -0.278651 -0.097147 -0.205032 -0.040401 -0.343280 -0.350460 -0.339319 -0.381486 -0.313007 -0.319061 0.341255 -0.540075 0.110181 -0.372067 -0.399716 0.028347 -0.342759 0.343220 -0.697054 -0.372540 -0.365583 -0.250045 -0.231235 -0.237722 0.223445 0.218560 0.192441 0.210864 0.221010 0.199383 0.250234 0.249344 0.191606 0.213054 0.215470 0.192305 0.229536 0.204882 0.241440 0.196153 0.239042 0.203826 0.191339 0.209239 0.216903 0.216198 0.217857 0.269669 0.227577 0.228300 0.231350
chargesum: 0.00000
title: Mulliken charges with hydrogens summed into heavy atoms:
elementType: O O N N N C C C C C C C C C C C C C C C C C C C C
charge: -0.247388 -0.278651 -0.097147 -0.205032 -0.040401 0.098725 0.052845 0.081075 0.118092 0.091653 0.088714 0.341255 -0.105658 0.110181 0.065526 -0.160674 0.028347 0.052406 0.343220 -0.054715 -0.154683 -0.095914 -0.022469 -0.002935 -0.006371
polarizability: 3.23553954e+02 3.67858656e+01 3.00675590e+02 -1.30860950e+01 -2.29238604e+01 1.58008840e+02
1716.lowfreq: -10.9969 -5.6824 -0.0009 -0.0008 -0.0007 2.4130 6.5773 15.9936 17.8041
frequency: -6.0614 15.7116 17.4717 27.0004 30.9697 55.9776 60.4919 76.9614 86.8176 96.4404 117.9370 126.9585 142.9470 197.9665 211.4294 225.5540 234.8695 243.8702 250.1861 263.2093 305.3156 313.5811 327.4478 345.3441 355.0824 389.3200 395.2547 400.8060 413.9000 443.1276 469.6777 484.1476 517.7317 560.8628 570.4010 590.3367 614.1148 619.3678 649.3782 665.4470 697.0816 730.7647 743.8079 755.0219 765.9101 781.5121 792.8868 797.2385 812.8907 840.2741 850.0530 888.5343 893.2129 901.4008 911.8763 928.4426 930.1048 958.8093 982.2333 988.9127 996.7871 999.2074 1002.4014 1011.9944 1027.1738 1030.7601 1042.9929 1053.4809 1067.1750 1071.2666 1084.1288 1089.4077 1098.6920 1104.4055 1109.0812 1130.0100 1137.0692 1173.4359 1187.1076 1190.9681 1194.3125 1203.9571 1211.9991 1240.6091 1249.5303 1256.8014 1269.3862 1275.0384 1286.9073 1289.8680 1294.2167 1309.9454 1312.2346 1317.5608 1324.3894 1331.2836 1333.3568 1343.6898 1347.1797 1365.5938 1370.9520 1381.6423 1389.0371 1389.6964 1391.8936 1422.3936 1437.7601 1444.8681 1450.0850 1452.1713 1453.2555 1460.9516 1467.2128 1475.7627 1477.2589 1477.4470 1479.3304 1486.9096 1492.4065 1564.9676 1586.8249 1612.0831 1621.5995 2868.5112 2878.7646 2902.5889 2954.5016 2959.3041 2963.7475 2973.3381 2976.0214 2986.0367 3010.8740 3028.1362 3035.3590 3035.6632 3042.6965 3054.6507 3059.6739 3071.4383 3073.5778 3079.7475 3084.6010 3126.5725 3130.8524 3134.4916 3143.9781 3150.3949 3161.1102 3171.9922
redmass: 5.0858 3.4634 3.1868 4.5043 3.9471 3.0134 1.9022 5.3914 4.1134 4.0082 3.3907 3.0968 4.1643 3.8959 3.4436 1.2523 2.6510 3.8549 2.1819 2.5695 2.7161 4.3243 3.4863 3.5164 3.3619 4.1149 2.4888 2.7909 3.3946 5.5985 2.7884 3.5984 4.8825 5.3894 3.4381 3.6429 3.3735 4.8727 4.9736 4.5595 1.7495 1.2559 2.0430 4.2688 3.1181 2.0481 1.5234 1.8603 2.6205 1.6057 1.2687 1.7379 2.4402 4.4031 1.6943 1.4501 1.3913 4.1772 1.3928 5.6848 2.6908 2.7310 1.3501 4.1275 2.2160 2.1351 3.8373 2.0059 2.6315 2.1860 1.9770 2.2749 1.7176 2.1655 2.1912 2.5249 2.6371 1.0596 1.2065 1.4636 1.3664 2.0272 1.4190 1.4299 3.0416 1.5884 1.3085 1.2576 1.4208 1.0770 1.2825 1.2801 1.4839 1.3436 1.4243 1.7214 1.5856 1.5326 1.3108 1.4043 1.2798 5.8098 1.4508 1.2159 2.5781 2.1571 1.2764 1.0826 1.0853 1.0984 1.1493 1.0970 1.0700 1.1201 1.7839 1.0425 1.5554 1.0813 2.5476 7.6996 6.1474 6.1208 7.7872 1.0700 1.0699 1.0685 1.0664 1.0665 1.0589 1.0387 1.0590 1.0601 1.0970 1.0906 1.0907 1.1006 1.0897 1.0590 1.1037 1.1002 1.1005 1.0966 1.0977 1.0848 1.1063 1.0885 1.0925 1.0921 1.0962 1.0993
irintensity: 0.0518 0.0473 0.0569 0.2772 0.1522 0.4204 0.5826 1.0449 0.1712 0.7666 3.0523 1.3305 2.4475 3.4089 0.6556 0.0835 4.8645 0.3111 0.5171 2.5793 2.6662 5.2103 7.7995 11.3196 2.7166 6.6407 0.5273 0.0311 3.3844 7.2264 0.7965 4.9088 11.2785 16.0384 3.7144 11.3603 10.2046 4.5965 9.9762 6.8483 47.4206 8.0976 4.9764 3.5841 3.3411 57.4575 3.9310 6.3020 15.2170 0.2186 0.5770 5.2593 7.8999 13.3227 18.3840 2.9955 7.8720 8.8128 0.4609 0.8058 69.1534 6.9467 0.7520 25.6715 8.3420 0.2079 20.6845 12.7286 4.6052 8.8390 22.6931 16.0859 3.0715 26.4014 2.6894 38.7536 94.8226 0.1702 4.5996 21.8360 1.6385 3.9216 1.6791 9.5624 23.0814 2.4290 5.1302 3.8662 34.2306 4.1327 2.2243 12.2069 6.2611 9.8896 7.0575 6.1947 2.6402 0.5310 6.8655 3.7127 5.5938 0.6144 4.1073 13.2715 10.5740 23.4202 21.7939 2.5946 1.4335 13.8122 1.9381 10.9764 0.3263 2.8699 9.5632 12.5546 4.6548 15.0473 36.6815 308.0890 3.9469 17.7253 38.6224 58.9831 70.0909 79.8543 34.8240 105.2494 27.9587 27.2794 20.4247 55.4916 11.2932 22.5880 31.1728 0.8342 27.4732 21.0884 6.0709 68.4050 73.4557 41.1315 35.9494 4.0106 3.0487 7.5198 5.0941 33.9178 27.2335 15.8648
temp: 298.150 k
press: 1.00000 atm
elementType: 8 8 7 7 7 6 6 6 6 6 6 6 6 6 6 6 6 6 6 6 6 6 6 6 6 1 1 1 1 1 1 1 1 1 1 1 1 1 1 1 1 1 1 1 1 1 1 1 1 1 1 1
symmnumber: 1
zpe: 1148863.2 jmol-1
zpe.correction: 0.437579 hartree
zpe.thermalcorrener: 0.461051 hartree
zpe.thermalcorrenthalpy: 0.461995 hartree
zpe.thermalcorrgfe: 0.381258 hartree
zpe.sumelectzpe: -1091.118155 hartree
zpe.sumelectthermal: -1091.094683 hartree
zpe.sumelectthermalent: -1091.093739 hartree
zpe.sumelectthermalfe: -1091.174476 hartree
dipole: -3.9998 -0.7884 0.9605
dipole: 4.1884
quadrupole: -153.9083 -141.3625 -152.0249
quadrupole: -3.8825 -1.4511 -3.2587
quadrupole: -4.8097 7.7361 -2.9263 -3.8825 -1.4511 -3.2587
hfenergy: -1091.5557342 hartree
pointgroup: C01 [X(C20H27N3O2)]
dipole: 1.5515193 -0.4194149 -0.3637311 debye
polarizability: 318.2643379|-38.2335905|305.3010137|-9.7743299|26.1433|158.6730319 unknown
InChI: InChI=1S/C20H27N3O2/c1-2-3-7-18-16-19(17-8-5-4-6-9-17)21-23(20(18)24)11-10-22-12-14-25-15-13-22/h4-6,8-9,16H,2-3,7,10-15H2,1H3
charge 0 multiplicity 1
52 atoms
O  -6.641881 -0.428151 -0.517068
O  -0.774705 2.075317 1.149061
N  -3.768533 -0.70811 -0.201623
N  -0.142166 -0.151638 0.755946
N  0.748035 -1.153426 0.460317
C  -2.326747 -0.467858 -0.425013
C  -4.469954 -1.266467 -1.386429
C  -4.485838 0.497898 0.294787
C  -1.548862 -0.58612 0.909293
C  -5.920997 -1.613098 -1.011197
C  -5.935208 0.131217 0.648869
C  1.573306 1.576108 0.706212
C  1.957712 3.031996 0.8120
C  0.154149 1.241042 0.888185
C  1.528541 3.856311 -0.437179
C  2.472301 0.561713 0.418876
C  2.045557 -0.811408 0.295011
C  1.887051 5.352701 -0.298655
C  2.983107 -1.926452 -0.015239
C  1.471362 6.177538 -1.535651
C  4.392148 -1.759592 0.074627
C  2.475652 -3.19825 -0.402905
C  5.265997 -2.828604 -0.219537
C  3.348736 -4.264013 -0.695449
C  4.750566 -4.085676 -0.607844
H  -2.131465 0.535324 -0.873333
H  -1.941189 -1.229471 -1.128047
H  -4.478668 -0.544175 -2.241046
H  -3.946893 -2.183992 -1.716324
H  -3.974436 0.895467 1.189982
H  -4.488518 1.307557 -0.47706
H  -2.010462 0.063268 1.669682
H  -1.54292 -1.629561 1.256318
H  -5.920268 -2.404122 -0.23023
H  -6.48899 -1.95855 -1.89095
H  -6.512383 1.023819 0.941376
H  -5.939469 -0.607857 1.478803
H  1.455938 3.4716 1.695716
H  3.051323 3.124996 0.955506
H  0.436112 3.748799 -0.574424
H  2.017216 3.438173 -1.340469
H  3.525669 0.814899 0.263455
H  1.390158 5.761108 0.604425
H  2.978937 5.457958 -0.131203
H  1.973551 5.805933 -2.448862
H  1.734049 7.244724 -1.416104
H  0.379981 6.114617 -1.703511
H  4.820987 -0.803458 0.392771
H  1.391638 -3.330231 -0.465915
H  6.348628 -2.680329 -0.139865
H  2.938335 -5.234908 -0.994674
H  5.429613 -4.914265 -0.83691
