program: Gaussian 09
title: 000208768
version: EM64L-G09RevD.01
frameworkgroup: C1[X(C14H16Cl2N2)]
method: RPBEPBE
basis: SDD
operation: Freq
keyword: #p
keyword: freq=noraman
keyword: PBEPBE/SDD
title: #p freq=noraman PBEPBE/SDD
converged: YES YES NO NO
title: Mulliken charges:
elementType: Cl Cl N N C C C C C C C C C C C C C C H H H H H H H H H H H H H H H H
charge: -0.040092 -0.026623 -0.157020 -0.149991 -0.403336 -0.425897 -0.362462 -0.467768 0.175671 -0.448665 -0.017946 0.284432 -0.330705 -0.403244 -0.589562 -0.043581 -0.176283 -0.140921 0.211993 0.216864 0.225599 0.210486 0.240917 0.212628 0.221824 0.259789 0.201502 0.282772 0.238428 0.257970 0.253826 0.220118 0.215761 0.253517
chargesum: 0.00000
title: Mulliken charges with hydrogens summed into heavy atoms:
elementType: Cl Cl N N C C C C C C C C C C C C C C
charge: -0.040092 -0.026623 -0.157020 -0.149991 0.025520 0.010188 0.091083 0.013845 0.175671 0.035608 0.220481 0.284432 -0.072735 -0.149418 -0.153683 -0.043581 0.077235 -0.140921
polarizability: 3.19078308e+02 6.45935316e+00 1.46964937e+02 -4.82214750e+00 1.83676567e+01 1.40775875e+02
1716.lowfreq: -6.8040 -1.5935 0.0006 0.0022 0.0024 10.1198 20.8865 25.7129 48.4166
frequency: 20.7957 25.6761 48.3391 60.2664 68.6644 86.0232 106.5344 119.4543 173.7175 186.4623 186.8952 211.8570 254.0022 302.5810 314.0137 335.0633 359.2292 386.9822 410.9922 436.7422 442.4379 461.3955 474.2038 496.2588 532.2757 570.1810 603.5234 647.1501 650.4148 687.8806 691.1139 733.8397 813.3550 826.3982 834.6427 852.7971 881.5442 908.5766 911.8746 923.0006 945.1549 949.7134 957.2691 990.0828 995.6174 1008.8440 1077.4297 1090.3176 1094.6324 1115.8900 1128.5104 1129.6029 1162.6369 1170.1312 1178.4648 1226.7822 1251.5262 1256.0319 1269.7537 1281.8225 1284.1950 1326.9121 1329.1510 1330.4040 1343.8366 1348.5780 1352.4232 1392.8269 1421.7561 1432.8924 1448.3831 1455.9295 1467.9234 1469.8936 1478.9980 1504.3294 1540.0937 1592.7299 1601.1586 1654.4855 2926.5712 2976.2713 2985.8111 2988.6931 2991.2553 3022.0263 3046.2124 3051.1017 3056.8495 3064.4277 3084.8255 3104.4406 3153.8899 3164.9806 3174.9086 3196.3360
redmass: 5.5903 4.6626 4.6200 5.7075 3.3070 2.9145 2.5676 4.5457 6.9149 6.2501 3.0960 4.6270 9.7135 3.3385 2.4758 2.8543 3.8118 5.3967 3.6572 3.5598 3.7610 2.3654 3.8210 3.9798 2.5912 5.0017 2.3402 4.5673 5.6717 3.5093 2.9130 3.5324 1.3900 1.6147 2.8485 1.5307 2.2712 1.5446 3.0958 1.4378 1.3355 1.4294 2.2293 3.5203 2.0354 1.2950 2.1789 2.2263 1.7449 2.2585 1.9444 1.3337 1.6041 1.6211 2.0839 1.8377 1.5426 1.3507 1.3715 1.2239 1.3434 1.3961 1.2895 3.9132 1.5413 1.6580 1.5593 5.0455 1.3843 1.5980 1.3080 1.1517 1.1558 1.2525 1.2498 1.4687 7.8705 7.3366 8.1244 4.5812 1.0688 1.0605 1.0671 1.0619 1.0620 1.0913 1.1005 1.0973 1.0987 1.1023 1.0601 1.0945 1.0880 1.0916 1.0973 1.1141
irintensity: 0.2181 0.2686 0.1276 0.9377 0.2645 0.9893 0.1135 1.1568 1.4557 0.7438 2.6184 1.7165 2.5512 2.2541 1.4690 5.8128 3.5836 1.7544 5.7465 13.7385 6.2427 3.5019 0.7023 3.0897 35.1587 5.6945 5.2670 7.4367 15.9937 21.0888 6.9736 11.2444 29.0640 3.5073 39.6531 27.9663 12.4105 16.1250 7.6559 3.2398 0.0793 67.4074 31.8870 9.4903 18.0863 23.5769 16.5572 46.2299 0.5436 58.5251 11.9706 2.2743 9.6889 49.9579 11.7372 20.8263 15.9211 58.6672 86.3836 1.2810 76.8562 24.8366 13.3207 5.0942 13.3271 96.0503 26.1288 1.9086 86.5543 67.5455 15.6051 31.8887 17.2946 6.0835 8.0233 8.6402 37.5406 351.8362 948.8549 20.2310 83.4728 69.9389 7.8500 35.3575 23.0504 35.9860 13.8638 39.8710 21.3662 45.5860 13.6191 8.3317 3.6675 4.8971 5.3373 24.0116
temp: 298.150 k
press: 1.00000 atm
elementType: 17 17 7 7 6 6 6 6 6 6 6 6 6 6 6 6 6 6 1 1 1 1 1 1 1 1 1 1 1 1 1 1 1 1
symmnumber: 1
zpe: 706292.4 jmol-1
zpe.correction: 0.269013 hartree
zpe.thermalcorrener: 0.286773 hartree
zpe.thermalcorrenthalpy: 0.287718 hartree
zpe.thermalcorrgfe: 0.220559 hartree
zpe.sumelectzpe: -1571.354338 hartree
zpe.sumelectthermal: -1571.336577 hartree
zpe.sumelectthermalent: -1571.335633 hartree
zpe.sumelectthermalfe: -1571.402791 hartree
dipole: -6.7627 1.6380 -1.3887
dipole: 7.0954
quadrupole: -121.6557 -117.9293 -117.5631
quadrupole: -5.5215 -2.2814 1.3572
quadrupole: -2.6063 1.1201 1.4862 -5.5215 -2.2814 1.3572
hfenergy: -1571.6233502 hartree
pointgroup: C01 [X(C14H16Cl2N2)]
dipole: 2.6822185 0.7649843 0.1153875 debye
polarizability: 318.4802626|-13.2939513|128.6298998|0.5976123|-9.8931326|159.7089575 unknown
InChI: InChI=1S/C14H16Cl2N2/c1-2-8-18-9-4-3-5-14(18)17-11-6-7-12(15)13(16)10-11/h2,6-7,10H,1,3-5,8-9H2
charge 0 multiplicity 1
34 atoms
Cl -4.132305 0.132665 -2.318539
Cl -5.892739 0.064466 0.476327
N  2.40226 0.099515 0.161062
N  0.164945 -0.264344 0.694035
C  3.179932 2.066394 -1.216121
C  1.908951 2.786602 -0.727461
C  3.551996 0.951199 -0.226913
C  0.745781 1.774373 -0.68098
C  1.070115 0.488245 0.088317
C  2.766128 -1.150993 0.877352
C  3.301556 -2.205852 -0.070493
C  -1.225435 -0.11572 0.591066
C  -1.916303 -0.024407 -0.656027
C  -2.006826 -0.172131 1.784435
C  4.530422 -2.773416 0.020893
C  -3.321707 0.027722 -0.692396
C  -3.41075 -0.107791 1.735506
C  -4.079697 -0.005063 0.495378
H  3.000201 1.638535 -2.221562
H  4.032847 2.764347 -1.301872
H  1.644073 3.625769 -1.396272
H  2.084585 3.215158 0.279063
H  4.325498 0.28996 -0.66092
H  3.987178 1.403715 0.692481
H  0.477638 1.498446 -1.720274
H  -0.16123 2.22003 -0.235973
H  3.520559 -0.918154 1.655322
H  1.842014 -1.503299 1.37044
H  2.61038 -2.51341 -0.868881
H  -1.359695 -0.030544 -1.597483
H  -1.48969 -0.270607 2.7432
H  4.858541 -3.55173 -0.676778
H  5.237667 -2.486905 0.81026
H  -3.99989 -0.142779 2.656809
