program: Gaussian 09
title: 000208758
version: EM64L-G09RevD.01
frameworkgroup: C1[X(C14H13NO2)]
method: RPBEPBE
basis: SDD
operation: Freq
keyword: #p
keyword: freq=noraman
keyword: PBEPBE/SDD
title: #p freq=noraman PBEPBE/SDD
converged: NO YES NO NO
title: Mulliken charges:
elementType: O O N C C C C C C C C C C C C C C H H H H H H H H H H H H H
charge: -0.255093 -0.245773 -0.060897 0.254895 0.338558 -0.316570 -0.334103 -0.372329 -0.375429 0.057540 0.020264 -0.245427 -0.254019 -0.683481 -0.205608 -0.162547 -0.366302 0.313905 0.280315 0.243788 0.252266 0.212864 0.212975 0.290268 0.208837 0.233645 0.233670 0.244298 0.234453 0.245037
chargesum: 0.00000
title: Mulliken charges with hydrogens summed into heavy atoms:
elementType: O O N C C C C C C C C C C C C C C
charge: -0.255093 -0.245773 -0.060897 0.254895 0.338558 -0.002665 -0.053788 -0.128541 -0.123163 0.057540 0.020264 0.180413 0.036249 -0.007329 0.038690 0.071906 -0.121265
polarizability: 2.96394278e+02 -3.71809349e+00 1.70682330e+02 -1.68566859e-01 9.43410765e-02 7.29598804e+01
1716.lowfreq: -5.6791 -0.0004 0.0002 0.0005 2.5113 6.6944 18.9665 40.2613 52.3296
frequency: 18.9339 40.2509 52.3187 82.9935 114.3256 126.4047 155.8306 159.7842 238.8560 244.5818 248.8513 292.8103 344.9075 398.0986 403.6241 416.2681 437.2863 452.8531 515.2158 539.9384 612.7492 623.4957 637.3952 679.5019 701.1059 746.7127 757.6686 775.4001 813.4778 821.9258 840.5955 863.6620 900.3050 915.7271 919.8583 970.3666 974.0897 999.7230 1003.2082 1010.2815 1020.7734 1033.3503 1038.2826 1083.8914 1114.1219 1120.2986 1135.1122 1149.0507 1162.1836 1185.0827 1230.6237 1263.6553 1276.4469 1289.6558 1303.7561 1319.5394 1363.7821 1374.2524 1402.1970 1406.0479 1432.0362 1446.6602 1462.1265 1476.2971 1485.1200 1495.9048 1509.5847 1555.8896 1570.3295 1577.3832 1615.5711 2963.5146 2998.4777 3023.8187 3095.3840 3108.5683 3127.6502 3144.5752 3151.6421 3154.2739 3167.1039 3170.1691 3173.5667 3181.0554
redmass: 4.3326 3.7734 4.6970 4.4432 2.7452 2.7240 5.4692 4.3757 5.4364 1.2050 5.2988 6.1290 4.4767 3.3096 5.2864 3.1092 3.8807 5.7181 2.8128 8.0259 7.2611 6.5153 7.1326 3.4027 6.2955 3.1659 1.7796 4.6849 1.5364 1.6040 1.1819 1.7940 3.6515 5.9664 1.3204 7.0254 1.4452 1.3477 2.7304 1.3278 1.3435 2.7427 2.3227 1.6067 1.7049 1.5547 1.4356 2.4032 1.1657 1.3821 3.0551 1.1422 1.6254 4.3256 1.3555 6.1466 1.6282 2.8146 1.2701 1.9448 4.0256 2.2559 1.0398 1.1457 1.2893 1.6783 9.1638 6.1301 7.0200 6.1484 6.3011 1.0555 1.0365 1.1076 1.0987 1.1015 1.0886 1.0901 1.0877 1.0887 1.0968 1.0960 1.0973 1.0976
irintensity: 3.2173 0.3325 0.2911 1.5060 0.0116 6.1014 1.0538 1.3407 0.7366 0.8871 11.3852 0.4920 4.3690 3.4496 0.3305 0.1314 0.3048 1.4215 7.5580 0.3445 29.3964 12.3793 38.1929 38.1895 0.9396 5.3090 68.1189 2.0756 8.1419 5.6865 0.6293 61.8391 73.3539 39.7213 0.6153 13.6535 1.6720 0.7523 2.6354 1.9843 1.1702 82.9598 12.1750 29.7830 1.0423 12.6180 4.6825 87.7799 83.5932 208.8225 216.9463 0.0109 27.3451 360.4743 3.2249 24.7280 11.1076 1.3882 30.1601 1.9273 51.7129 2.8191 12.2166 39.9307 41.3495 11.4266 263.4181 13.9594 11.7849 7.3203 262.0358 33.0617 28.4116 31.5444 27.0612 33.9410 12.5704 14.1311 0.1862 8.1670 23.4172 6.8713 49.1084 12.4838
temp: 298.150 k
press: 1.00000 atm
elementType: 8 8 7 6 6 6 6 6 6 6 6 6 6 6 6 6 6 1 1 1 1 1 1 1 1 1 1 1 1 1
symmnumber: 1
zpe: 617334.0 jmol-1
zpe.correction: 0.235130 hartree
zpe.thermalcorrener: 0.250085 hartree
zpe.thermalcorrenthalpy: 0.251029 hartree
zpe.thermalcorrgfe: 0.191072 hartree
zpe.sumelectzpe: -745.270068 hartree
zpe.sumelectthermal: -745.255114 hartree
zpe.sumelectthermalent: -745.254169 hartree
zpe.sumelectthermalfe: -745.314127 hartree
dipole: 0.0928 -4.2308 0.0337
dipole: 4.2320
quadrupole: -66.5671 -95.7946 -103.1771
quadrupole: 0.3209 -0.1220 0.0346
quadrupole: 21.9458 -7.2817 -14.6641 0.3209 -0.1220 0.0346
hfenergy: -745.5051982 hartree
pointgroup: C01 [X(C14H13N1O2)]
dipole: 0.0019472 1.6629059 0.0831695 debye
polarizability: 295.9764331|6.680047|170.5710994|-6.511662|5.5528314|73.488956 unknown
InChI: InChI=1S/C14H13NO2/c1-2-17-12-8-6-11(7-9-12)14(16)13-5-3-4-10-15-13/h3-10H,2H2,1H3
charge 0 multiplicity 1
30 atoms
O  4.244379 0.0035 -0.133423
O  -1.68739 -2.327859 -0.069293
N  -2.32824 1.247122 0.163683
C  0.061416 -0.689733 -0.034901
C  2.857757 -0.14811 -0.096601
C  0.546858 0.647162 0.023635
C  1.018232 -1.75011 -0.126021
C  1.928758 0.920761 -0.006879
C  2.391168 -1.490207 -0.156472
C  -1.37518 -1.09014 -0.010202
C  -2.538361 -0.106318 0.081187
C  4.801589 1.374066 -0.070897
C  -3.847778 -0.661084 0.076913
C  6.319943 1.234559 -0.124387
C  -4.96298 0.196086 0.159317
C  -4.747078 1.591078 0.244616
C  -3.414877 2.064039 0.24332
H  -0.179121 1.460018 0.093491
H  0.642143 -2.776962 -0.171699
H  2.266686 1.960159 0.039211
H  3.126821 -2.297237 -0.225744
H  4.417969 1.962734 -0.928677
H  4.471206 1.85885 0.870013
H  -3.945292 -1.747713 0.009101
H  6.793185 2.232463 -0.082527
H  6.686859 0.63698 0.727167
H  6.632883 0.737692 -1.05825
H  -5.97882 -0.212694 0.157299
H  -5.581594 2.296156 0.310796
H  -3.20324 3.137637 0.307323
