program: Gaussian 09
title: 000208769
version: EM64L-G09RevD.01
frameworkgroup: C1[X(C15H19ClN2)]
method: RPBEPBE
basis: SDD
operation: Freq
keyword: #p
keyword: freq=noraman
keyword: PBEPBE/SDD
title: #p freq=noraman PBEPBE/SDD
converged: YES YES NO NO
title: Mulliken charges:
elementType: Cl N N C C C C C C C C C C C C C C C H H H H H H H H H H H H H H H H H H H
charge: -0.090748 -0.159840 -0.150315 -0.402298 -0.425996 -0.361376 -0.466725 0.172214 -0.449823 -0.017783 0.268883 -0.344995 -0.409826 0.498609 -0.260042 -0.383242 -0.592099 -0.799089 0.210854 0.214365 0.223366 0.208972 0.238926 0.209525 0.220727 0.259207 0.199864 0.284138 0.237607 0.255332 0.247019 0.229639 0.218511 0.215237 0.218383 0.240436 0.242383
chargesum: 0.00000
title: Mulliken charges with hydrogens summed into heavy atoms:
elementType: Cl N N C C C C C C C C C C C C C C C
charge: -0.090748 -0.159840 -0.150315 0.022921 0.006342 0.087075 0.013208 0.172214 0.034180 0.219824 0.268883 -0.089663 -0.162807 0.498609 -0.260042 -0.153602 -0.158351 -0.097888
polarizability: 3.09723124e+02 4.34990736e+00 1.52005360e+02 -6.27009048e+00 1.77227877e+01 1.48219753e+02
1716.lowfreq: -7.9502 -3.1883 0.0016 0.0023 0.0024 9.1238 19.3905 29.0383 53.3905
frequency: 18.9995 28.9442 53.3142 62.5430 67.8921 84.7816 104.9306 109.2619 136.4645 180.1949 187.8421 209.9012 234.8367 279.1901 307.2578 321.8054 341.0699 360.9370 405.2289 416.2016 438.5022 449.9622 461.3653 480.0183 519.4169 553.7411 594.7908 605.1587 652.3836 684.5761 699.9690 719.1468 763.2320 821.2886 826.2292 843.0824 854.2848 882.1993 909.4856 913.0979 922.2427 947.6616 947.8149 957.7809 990.1075 994.1231 1008.9890 1017.9714 1042.8995 1078.1187 1091.9846 1094.5806 1129.8666 1140.0355 1162.3993 1168.5134 1177.3721 1213.6338 1238.6843 1253.5411 1266.8942 1269.6441 1281.7461 1283.2061 1326.3607 1328.2485 1330.5604 1342.9529 1347.7030 1351.5856 1398.3505 1404.1029 1422.1073 1435.3251 1451.8781 1459.9622 1460.4693 1467.5671 1468.3793 1474.9882 1484.0897 1505.6086 1541.2728 1598.6865 1616.7865 1654.2365 2920.4467 2971.1028 2979.4810 2985.0918 2987.5246 2989.8583 3020.2419 3040.8978 3049.0274 3056.2293 3057.4030 3063.7662 3083.9633 3088.3166 3102.8877 3125.5641 3160.5714 3164.4206 3195.3563
redmass: 5.3509 3.5987 3.6193 5.0820 3.3001 2.9158 1.1189 2.0798 3.3238 3.0247 4.0842 3.9164 4.6512 4.5547 1.9961 3.5533 2.6804 3.6439 5.9515 2.7016 3.1151 3.6689 2.3434 3.2604 2.5185 4.5516 3.9716 2.3364 3.8680 4.4659 2.7487 3.2421 4.0441 1.3538 1.4739 3.3562 1.5255 2.2794 1.5379 3.1524 1.4339 1.3453 1.3851 2.3213 1.4719 1.7986 1.2890 2.7621 1.4937 2.1612 2.2231 1.7412 1.9457 1.2694 1.5993 1.6340 2.0112 1.8040 3.1015 1.4185 1.3364 1.3946 1.2348 1.3339 1.4115 1.3071 3.7447 1.5325 1.6941 1.5532 1.5151 2.6897 1.3447 1.5124 1.2173 1.1695 1.0458 1.1144 1.1490 1.1648 1.5848 1.6039 4.9950 8.3928 7.6872 4.5698 1.0693 1.0606 1.0367 1.0670 1.0617 1.0623 1.0907 1.1002 1.0977 1.0994 1.0974 1.1012 1.0601 1.0994 1.0944 1.0887 1.0937 1.0935 1.1141
irintensity: 0.3694 0.3528 0.3722 2.1415 0.5089 1.1696 0.3738 0.0976 0.1931 4.4449 1.3979 0.5444 1.8608 2.9357 3.0323 2.2421 4.8779 4.1204 3.1265 7.8519 8.4268 1.1613 3.7368 0.1084 10.8445 11.5979 7.5789 3.5307 1.6286 25.8737 2.8075 30.4018 4.1587 26.1528 3.6496 51.5425 25.7190 9.7433 13.3727 6.3222 1.4590 4.6464 65.4068 27.7270 18.5175 15.5370 29.1530 35.6413 7.8588 11.4223 27.3734 1.2790 11.6670 2.6685 10.2123 46.7088 17.5207 12.0616 9.2203 75.5293 35.4667 59.8472 6.8930 69.7666 24.6852 14.7777 4.2216 10.9843 90.3704 18.7549 10.4718 0.6851 55.7059 40.9681 8.4822 38.1860 13.8947 17.7152 1.3174 23.2324 20.5453 13.1194 44.2668 1214.6052 3.0933 20.7988 88.0243 77.1874 41.9029 13.9958 30.3772 22.5789 38.4640 16.8535 44.0318 26.3862 17.8071 40.8403 14.1805 18.8532 8.5819 21.4648 12.0235 5.3151 25.1110
temp: 298.150 k
press: 1.00000 atm
elementType: 17 7 7 6 6 6 6 6 6 6 6 6 6 6 6 6 6 6 1 1 1 1 1 1 1 1 1 1 1 1 1 1 1 1 1 1 1
symmnumber: 1
zpe: 802555.0 jmol-1
zpe.correction: 0.305677 hartree
zpe.thermalcorrener: 0.323915 hartree
zpe.thermalcorrenthalpy: 0.324859 hartree
zpe.thermalcorrgfe: 0.257123 hartree
zpe.sumelectzpe: -1151.198378 hartree
zpe.sumelectthermal: -1151.180140 hartree
zpe.sumelectthermalent: -1151.179195 hartree
zpe.sumelectthermalfe: -1151.246932 hartree
dipole: -3.9474 1.6195 -1.5076
dipole: 4.5252
quadrupole: -104.1800 -113.7599 -113.4928
quadrupole: -6.6931 -4.6390 0.6290
quadrupole: 6.2976 -3.2824 -3.0152 -6.6931 -4.6390 0.6290
hfenergy: -1151.5040547 hartree
pointgroup: C01 [X(C15H19Cl1N2)]
dipole: 1.5917485 0.7670956 0.2180653 debye
polarizability: 308.3863288|-16.6039575|136.099756|2.5045788|-9.5100009|165.4621532 unknown
InChI: InChI=1S/C15H19ClN2/c1-3-9-18-10-5-4-6-15(18)17-13-8-7-12(2)14(16)11-13/h3,7-8,11H,1,4-6,9-10H2,2H3
charge 0 multiplicity 1
37 atoms
Cl -4.0941 0.22235 -2.375315
N  2.432238 0.079309 0.14329
N  0.184429 -0.24726 0.664699
C  3.250876 2.043541 -1.212457
C  1.982157 2.777727 -0.739149
C  3.595829 0.921764 -0.220484
C  0.806438 1.779552 -0.709985
C  1.103929 0.490316 0.06531
C  2.769885 -1.173937 0.865643
C  3.328794 -2.228384 -0.068437
C  -1.205546 -0.064635 0.552991
C  -1.885672 0.027639 -0.699417
C  -1.998524 -0.080865 1.737154
C  -4.099864 0.124187 0.433767
C  -3.286775 0.116535 -0.72344
C  -3.400849 0.021011 1.668162
C  4.546751 -2.811712 0.063182
C  -5.610561 0.218678 0.380108
H  3.078818 1.619257 -2.220808
H  4.113445 2.731235 -1.285539
H  1.736642 3.62183 -1.40943
H  2.150074 3.201788 0.270729
H  4.371782 0.255814 -0.642971
H  4.019824 1.369103 0.707241
H  0.550491 1.506133 -1.752954
H  -0.102052 2.235136 -0.27855
H  3.500434 -0.949465 1.669028
H  1.828508 -1.522159 1.328958
H  2.663949 -2.52233 -0.894041
H  -1.323856 -0.006865 -1.637211
H  -1.490165 -0.178432 2.70137
H  -3.985903 0.014634 2.595708
H  4.890334 -3.589608 -0.627572
H  5.228528 -2.538713 0.879317
H  -6.037416 0.208481 1.397362
H  -5.940775 1.145301 -0.125038
H  -6.048599 -0.623258 -0.187623
