program: Gaussian 09
title: 000208741
version: EM64L-G09RevD.01
frameworkgroup: C1[X(C12H15N)]
method: RPBEPBE
basis: SDD
operation: Freq
keyword: #pfreq=noraman
keyword: PBEPBE/SDD
title: #p freq=noraman PBEPBE/SDD
converged: YES YES NO NO
title: Mulliken charges:
elementType: N C C C C C C C C C C C C H H H H H H H H H H H H H H H
charge: -0.256835 -0.325362 -0.216849 -0.477103 -0.436988 0.371028 -0.470839 -0.609024 0.368466 -0.452163 -0.454472 -0.242641 -0.238354 0.232088 0.247556 0.240255 0.223594 0.237497 0.211726 0.226082 0.215945 0.253595 0.213872 0.223447 0.233280 0.234623 0.223564 0.224012
chargesum: 0.00000
title: Mulliken charges with hydrogens summed into heavy atoms:
elementType: N C C C C C C C C C C C C
charge: -0.003240 -0.093274 0.030707 -0.013254 0.012236 0.371028 -0.028811 -0.171705 0.368466 -0.218883 -0.219849 -0.019077 -0.014342
polarizability: 1.64941795e+02 -5.66422639e-01 1.24868828e+02 3.29274025e-01 8.75002627e+00 8.98410968e+01
1716.lowfreq: -20.4530 -11.2572 -9.9766 -0.0009 -0.0008 -0.0005 62.1340 118.1639 129.8594
frequency: 61.6708 118.1553 129.7871 164.0734 230.2536 296.7058 338.1175 369.4242 424.4455 448.7381 475.8223 539.9975 573.0197 618.4864 653.0628 695.6773 707.2034 741.4765 758.1014 765.3157 785.7816 813.1200 846.2105 872.5343 878.2261 920.5469 942.2656 947.3845 954.6929 984.1960 995.3785 1030.4210 1033.2622 1038.5824 1080.6018 1102.6813 1111.9584 1157.5043 1169.8733 1174.0461 1188.4996 1199.8768 1211.8760 1221.0699 1234.3373 1263.5846 1274.2890 1284.3054 1309.0204 1321.9586 1328.0448 1337.9853 1348.6387 1386.7475 1427.8619 1442.8034 1460.3882 1464.4781 1474.5458 1484.6044 1489.9616 1590.3175 1613.6405 2973.5991 2991.7224 2993.0033 2994.5220 3009.8578 3030.5304 3038.5057 3055.3534 3065.9459 3078.0897 3109.7100 3115.4144 3133.8111 3156.3294 3414.2204
redmass: 3.3361 3.1986 2.7457 1.9736 2.8274 4.0545 2.7799 4.3386 2.3661 2.5766 3.6198 4.0154 3.2865 4.1431 3.2328 1.7751 2.9718 2.7197 1.7417 2.0134 2.6382 2.6007 2.1102 2.2990 1.4168 2.8345 1.8989 1.6633 2.3596 1.3209 2.7600 2.3279 2.2040 1.7571 2.8716 1.9805 1.9745 1.1424 1.1603 1.2394 1.5564 2.0291 1.3578 1.5100 1.3392 1.4331 1.3100 1.3091 1.3557 1.2620 1.4309 1.3538 1.5560 5.2366 1.2337 2.3497 1.1224 1.1202 1.0819 2.4178 1.0898 6.6223 6.6522 1.0638 1.0688 1.0649 1.0766 1.0643 1.0887 1.0938 1.1004 1.1018 1.1051 1.0864 1.0889 1.0929 1.1004 1.0752
irintensity: 0.5383 0.3405 1.1735 4.9359 0.8173 1.2083 1.9736 0.1852 5.7841 9.0115 9.3631 2.3973 0.4669 2.8521 3.0713 134.4120 26.7438 17.8749 50.4773 23.9458 3.4686 4.4153 6.8683 7.9389 2.8068 8.2078 0.5465 7.7614 3.1705 0.0130 8.5044 4.9423 1.7404 3.9589 4.7237 13.0258 5.4440 0.8132 2.1622 4.7308 13.9580 1.3223 0.8068 1.2515 5.5287 3.7966 2.1992 0.8701 1.0962 0.8084 0.2056 0.2045 3.8489 0.3137 5.0300 3.9133 5.9656 13.2664 3.0150 26.0117 15.4471 1.7767 1.1215 29.0134 13.7323 45.1367 23.0539 49.4560 38.2904 44.7777 12.8305 31.3029 60.7316 13.7889 2.8416 33.5996 37.2526 2.2162
temp: 298.150 k
press: 1.00000 atm
elementType: 7 6 6 6 6 6 6 6 6 6 6 6 6 1 1 1 1 1 1 1 1 1 1 1 1 1 1 1
symmnumber: 1
zpe: 636821.6 jmol-1
zpe.correction: 0.242553 hartree
zpe.thermalcorrener: 0.252854 hartree
zpe.thermalcorrenthalpy: 0.253798 hartree
zpe.thermalcorrgfe: 0.206749 hartree
zpe.sumelectzpe: -520.062756 hartree
zpe.sumelectthermal: -520.052455 hartree
zpe.sumelectthermalent: -520.051511 hartree
zpe.sumelectthermalfe: -520.098560 hartree
dipole: -0.1790 -1.0638 -0.0059
dipole: 1.0787
quadrupole: -78.2517 -72.9545 -78.4638
quadrupole: 5.4903 -0.1191 3.1433
quadrupole: -1.6951 3.6022 -1.9071 5.4903 -0.1191 3.1433
hfenergy: -520.3053089 hartree
pointgroup: C01 [X(C12H15N1)]
dipole: 0.0852513 -0.4045109 0.0960276 debye
polarizability: 164.8565617|1.8570466|119.271984|-0.448457|-15.6198394|95.5231749 unknown
InChI: InChI=1S/C12H15N/c1-2-4-10-9(3-1)5-6-12-11(10)7-8-13-12/h1-4,11-13H,5-8H2
charge 0 multiplicity 1
28 atoms
N  3.155448 0.160158 0.465777
C  0.912835 -0.81329 0.604311
C  1.782897 0.455154 0.98042
C  1.629782 -1.398272 -0.674257
C  1.213126 1.781564 0.391938
C  -0.559873 -0.515727 0.384076
C  2.963665 -0.586559 -0.811691
C  0.210048 1.581824 -0.776884
C  -0.914349 0.65667 -0.344273
C  -1.579905 -1.377211 0.852339
C  -2.277187 0.936441 -0.59503
C  -2.941244 -1.095743 0.593451
C  -3.291377 0.063399 -0.136363
H  1.012731 -1.551152 1.423221
H  1.845523 0.561821 2.078483
H  0.992988 -1.28815 -1.569723
H  1.822308 -2.477738 -0.540473
H  2.070841 2.399206 0.070767
H  0.688504 2.332981 1.195294
H  3.840622 -1.225853 -1.015032
H  2.883873 0.138131 -1.644097
H  3.677158 -0.413124 1.145975
H  0.743065 1.157626 -1.651873
H  -0.194303 2.55898 -1.100578
H  -1.30646 -2.274936 1.421422
H  -2.54705 1.845225 -1.1475
H  -3.721874 -1.771756 0.960579
H  -4.344592 0.289629 -0.338279
