program: Gaussian 09
title: 000208747
version: EM64L-G09RevD.01
frameworkgroup: C1[X(C13H19NO)]
method: RPBEPBE
basis: SDD
operation: Freq
keyword: #p
keyword: freq=noraman
keyword: PBEPBE/SDD
title: #p freq=noraman PBEPBE/SDD
converged: YES YES NO NO
title: Mulliken charges:
elementType: O N C C C C C C C C C C C C C H H H H H H H H H H H H H H H H H H H
charge: -0.210767 0.005397 -0.387377 -0.363043 -0.391941 -0.355095 -0.538788 -0.356166 0.146651 -0.696299 0.309531 -0.290740 -0.285499 -0.351703 -0.336399 0.233133 0.180576 0.195686 0.180983 0.223254 0.198936 0.191513 0.184650 0.244702 0.231214 0.193280 0.196601 0.208882 0.210872 0.215171 0.245461 0.275015 0.244050 0.248261
chargesum: 0.00000
title: Mulliken charges with hydrogens summed into heavy atoms:
elementType: O N C C C C C C C C C C C C C
charge: -0.210767 0.005397 0.026332 0.013626 0.030249 0.021067 -0.062872 0.033715 0.146651 -0.061374 0.309531 -0.045279 -0.010484 -0.107653 -0.088138
polarizability: 1.93906526e+02 6.76252709e+00 1.34704314e+02 1.72525119e+01 -1.46709667e+01 1.12210987e+02
1716.lowfreq: -7.2249 -2.6549 -0.0004 0.0001 0.0007 9.1819 19.8797 26.0081 40.6068
frequency: 19.7358 25.8548 40.4997 54.1031 78.9182 104.5630 115.8469 137.2743 147.3450 153.8015 232.4640 241.6544 242.8003 298.1362 353.6690 364.7084 402.6057 423.3664 446.8920 498.6174 579.6689 634.5905 659.1278 714.1756 724.3194 743.2541 748.0046 799.4240 811.7701 870.1738 883.0479 894.6170 899.0675 958.3168 959.7405 972.6428 984.9485 993.9280 1007.9883 1029.6885 1057.0502 1057.6155 1075.4351 1079.8909 1088.9409 1111.8476 1123.0414 1186.4221 1195.8596 1211.3901 1224.9115 1242.0721 1253.0861 1282.3675 1288.2106 1292.8955 1298.7959 1299.0894 1321.1526 1334.9330 1346.0709 1354.0237 1360.1430 1388.3526 1399.9449 1427.5489 1452.9500 1461.1425 1462.0326 1463.5595 1472.3794 1478.2000 1481.1794 1487.9767 1544.9224 1576.7243 1604.4135 2950.2387 2953.2866 2957.1191 2959.8780 2967.4577 2971.3342 2983.8898 2988.9298 3004.6012 3009.1375 3023.5382 3035.1933 3055.2147 3068.2621 3070.4797 3134.4106 3140.6939 3164.5992 3170.4912
redmass: 6.0432 3.8827 1.8604 3.0944 3.4664 3.0169 1.7807 2.4878 4.8196 4.2943 2.1952 1.4375 1.8414 5.0992 4.5056 2.4809 2.4738 4.1370 5.3208 3.3214 2.6608 3.9626 6.9737 1.7941 1.1011 3.4682 1.3929 1.4377 1.3461 2.1536 1.3982 1.2530 1.7332 3.0756 6.6376 1.4545 1.3906 1.4376 3.8334 2.3589 2.3944 2.1058 1.8125 2.0835 1.6785 2.0316 2.0821 1.4431 1.6470 1.5401 1.8126 1.3173 1.3815 1.1072 1.1515 1.2471 5.7648 1.1660 1.5537 1.4059 1.6349 1.6455 1.5686 1.2173 1.8829 1.1045 1.0817 1.8832 1.0761 1.0771 1.0780 1.0425 1.0806 1.0858 7.5334 5.5850 8.6725 1.0590 1.0600 1.0609 1.0634 1.0595 1.0366 1.0639 1.0948 1.0983 1.0962 1.0988 1.1025 1.1034 1.1007 1.0993 1.0885 1.0899 1.0952 1.0972
irintensity: 0.0093 0.2410 0.1150 1.1678 0.1871 1.9167 0.4926 0.7492 2.5152 1.9869 0.7246 0.0488 0.0121 10.7358 1.3820 0.0498 2.0085 4.1290 1.1853 6.5052 11.5339 10.6216 1.9945 12.4927 9.2553 0.1369 0.1252 10.3359 59.6211 3.2001 0.2276 1.9876 3.2579 27.5863 2.3147 0.8908 4.9360 0.9470 10.1123 1.2817 1.6634 11.8838 0.5096 0.1949 1.6952 11.5772 5.1830 4.8177 24.2643 48.3439 63.2296 1.2996 23.1859 5.3844 3.9898 1.3978 0.1877 8.6558 1.6163 0.6630 58.7871 1.2248 0.2166 11.1351 29.3789 25.4992 9.7625 0.3892 0.3618 0.9184 1.3688 12.4168 4.3513 21.4045 36.0374 1.2838 61.7551 2.3129 5.4627 29.0545 37.4942 106.7021 35.9295 32.4781 8.9407 1.6760 20.4820 14.0797 36.8835 69.0766 98.8176 57.1736 16.4541 13.3007 17.9878 4.7140
temp: 298.150 k
press: 1.00000 atm
elementType: 8 7 6 6 6 6 6 6 6 6 6 6 6 6 6 1 1 1 1 1 1 1 1 1 1 1 1 1 1 1 1 1 1 1
symmnumber: 1
zpe: 763496.7 jmol-1
zpe.correction: 0.290801 hartree
zpe.thermalcorrener: 0.306935 hartree
zpe.thermalcorrenthalpy: 0.307880 hartree
zpe.thermalcorrgfe: 0.244211 hartree
zpe.sumelectzpe: -635.600327 hartree
zpe.sumelectthermal: -635.584192 hartree
zpe.sumelectthermalent: -635.583248 hartree
zpe.sumelectthermalfe: -635.646916 hartree
dipole: 1.0554 2.2500 -0.9045
dipole: 2.6447
quadrupole: -106.1591 -85.9137 -94.5636
quadrupole: -2.8095 -2.2666 -2.6418
quadrupole: -10.6136 9.6318 0.9819 -2.8095 -2.2666 -2.6418
hfenergy: -635.8911274 hartree
pointgroup: C01[X(C13H19N1O1)]
dipole: 0.3935265 -0.5496872 0.7909827 debye
polarizability: 195.3776151|-12.2992843|114.4373237|-7.7883307|-17.2996498|131.0068874 unknown
InChI: InChI=1S/C13H19NO/c1-2-3-4-5-6-7-13(15)12-8-10-14-11-9-12/h8-11H,2-7H2,1H3
charge 0 multiplicity 1
34 atoms
O  -0.493815 -0.19725 -1.61918
N  -5.199578 0.775803 0.064213
C  2.026869 -0.344002 0.457147
C  3.519432 -0.617192 0.166863
C  1.138034 -1.591485 0.248289
C  4.42009 0.617206 0.396428
C  -0.354695 -1.336317 0.539447
C  5.912104 0.352295 0.090869
C  -1.064516 -0.509506 -0.535504
C  6.805647 1.588334 0.3314
C  -2.494819 -0.08065 -0.292913
C  -3.226699 -0.432191 0.870789
C  -3.150294 0.70869 -1.273505
C  -4.561669 0.013351 1.001625
C  -4.484417 1.109672 -1.054955
H  1.670982 0.470926 -0.202106
H  1.918474 0.015114 1.502901
H  3.62819 -0.95969 -0.883295
H  3.874165 -1.453192 0.806454
H  1.246181 -1.940496 -0.79651
H  1.495784 -2.408942 0.905603
H  4.060819 1.455459 -0.23641
H  4.318361 0.957011 1.448782
H  -0.903681 -2.298181 0.629793
H  -0.474767 -0.831295 1.52014
H  6.268354 -0.490831 0.71783
H  6.013713 0.020356 -0.962578
H  6.748195 1.920067 1.385604
H  6.486877 2.436556 -0.303565
H  7.865813 1.374134 0.10195
H  -2.782779 -1.040473 1.664363
H  -2.608556 0.99124 -2.181283
H  -5.153254 -0.243479 1.887556
H  -5.016146 1.721157 -1.792043
