program: Gaussian 09
title: 000208725
version: EM64L-G09RevD.01
frameworkgroup: C1[X(C9H19NO)]
method: RPBEPBE
basis: SDD
operation: Freq
keyword: #p
keyword: freq=noraman
keyword: PBEPBE/SDD
title: #p freq=noraman PBEPBE/SDD
converged: YES YES NO NO
title: Mulliken charges:
elementType: O N C C C C C C C C C H H H H H H H H H H H H H H H H H H H
charge: -0.262088 -0.624062 0.305565 -0.417510 0.182620 -0.726464 -0.716196 -0.725534 -0.731195 -0.720416 0.191576 0.200427 0.169593 0.206402 0.210021 0.214403 0.208107 0.202603 0.238689 0.206983 0.239899 0.202341 0.197443 0.224284 0.233856 0.221260 0.234909 0.196321 0.329730 0.306431
chargesum: 0.00000
title: Mulliken charges with hydrogens summed into heavy atoms:
elementType: O N C C C C C C C C C
charge: -0.262088 0.012100 0.305565 -0.047490 0.182620 -0.095637 -0.066798 -0.076311 -0.075612 -0.067926 0.191576
polarizability: 1.09762415e+02 8.05229103e-01 1.02957660e+02 8.56798605e-01 -1.98154468e+00 1.03709427e+02
1716.lowfreq: -16.8574 -0.0003 -0.0003 0.0002 5.4878 14.5570 46.5341 57.5578 105.7867
frequency: 46.4507 57.4711 105.6281 164.9583 196.4397 208.8423 222.6641 236.7971 252.4826 256.2843 267.6079 285.5467 304.2940 329.4391 363.2380 372.1308 402.4417 410.9514 470.4947 483.5473 500.4129 543.2268 582.3018 681.3403 736.4527 742.3809 832.1348 872.0690 910.9157 925.4712 929.3529 941.3641 942.7446 974.4838 1002.3378 1022.5383 1030.2437 1048.6131 1123.8879 1141.9518 1198.6412 1214.3199 1228.5399 1253.6799 1292.7690 1335.9044 1340.1515 1371.6005 1379.1759 1380.5877 1397.7436 1404.7578 1448.6686 1457.0656 1459.3557 1463.0340 1467.6346 1471.7823 1475.8601 1477.1309 1487.2968 1493.3648 1499.8846 1582.3487 1629.9750 2940.5200 2961.5286 2971.4933 2972.5983 2976.5193 2993.0308 2994.0730 3054.8090 3058.6648 3060.3323 3066.2737 3067.9561 3078.6543 3081.1480 3085.9312 3100.4412 3110.6033 3519.4939 3674.6068
redmass: 3.0974 4.4295 3.1907 1.6679 1.6566 1.6450 1.0927 1.4781 1.5215 1.1919 1.3108 2.1123 2.5340 2.7289 2.2131 2.3485 2.4496 1.8288 2.4524 1.2149 2.2209 2.7012 1.3871 3.2301 3.4723 4.8411 2.2437 1.9250 1.9913 1.7191 1.6470 1.2971 1.3547 1.7380 1.3218 1.4410 1.4226 1.8242 1.6038 2.2759 2.6420 2.4975 3.4674 3.1834 2.2028 1.3688 2.1913 1.2022 1.2078 1.2082 1.2186 1.2051 1.0545 1.0611 1.0566 1.0575 1.0569 1.0539 1.0581 1.0551 1.0623 1.0637 1.0604 1.8297 2.3635 1.0593 1.0350 1.0366 1.0350 1.0379 1.0718 1.0635 1.0996 1.0992 1.0995 1.0991 1.0983 1.1007 1.0991 1.0997 1.0966 1.0976 1.0444 1.1039
irintensity: 2.6957 11.9788 0.2058 0.0255 0.7339 0.0835 0.1569 0.3954 0.5688 1.3287 0.5683 1.2056 4.6932 0.9213 0.4847 0.4859 1.3079 3.7459 10.0536 158.8775 19.0282 15.8851 81.5215 4.0482 6.6516 12.4311 6.5480 1.0150 4.1512 2.6698 0.8021 2.5041 1.6563 7.5368 1.2295 0.7877 0.1903 0.5138 3.1418 5.0394 0.2742 42.1074 28.9865 18.4557 22.2205 4.9684 42.7585 13.0761 17.9365 22.7465 24.0157 15.0045 3.3248 3.4550 1.1642 5.3346 1.9773 5.0055 8.5419 14.3625 4.8421 27.4513 26.8214 83.9976 241.5843 36.8994 37.7914 42.1056 38.8863 17.4038 2.4025 51.0299 3.7962 50.3208 5.8613 39.4860 108.1761 4.7678 27.9764 66.7370 26.8246 23.5404 21.8773 21.7868
temp: 298.150 k
press: 1.00000 atm
elementType: 8 7 6 6 6 6 6 6 6 6 6 1 1 1 1 1 1 1 1 1 1 1 1 1 1 1 1 1 1 1
symmnumber: 1
zpe: 699228.5 jmol-1
zpe.correction: 0.266322 hartree
zpe.thermalcorrener: 0.280428 hartree
zpe.thermalcorrenthalpy: 0.281372 hartree
zpe.thermalcorrgfe: 0.227220 hartree
zpe.sumelectzpe: -483.430861 hartree
zpe.sumelectthermal: -483.416755 hartree
zpe.sumelectthermalent: -483.415811 hartree
zpe.sumelectthermalfe: -483.469962 hartree
dipole: 1.0232 -0.0456 3.6993
dipole: 3.8385
quadrupole: -73.6419 -66.3498 -72.8972
quadrupole: 0.7904 -7.9303 -4.4774
quadrupole: -2.6789 4.6131 -1.9342 0.7904 -7.9303 -4.4774
hfenergy: -483.6971827 hartree
pointgroup: C01 [X(C9H19N1O1)]
dipole: 0.5169246 -0.3100105 -1.3846819 debye
polarizability: 109.702537|-1.2987292|102.348152|-0.2809793|-1.742419|104.3788132 unknown
InChI: InChI=1S/C9H19NO/c1-8(2,3)6-9(4,5)7(10)11/h6,10H2,1-5H3
charge 0 multiplicity 1
30 atoms
O  -2.06699 1.287057 0.966918
N  -1.589536 1.544357 -1.272378
C  1.732666 0.009102 0.071096
C  0.529572 -0.592816 -0.739023
C  -0.940395 -0.615328 -0.18225
C  2.899157 0.183866 -0.945827
C  1.40644 1.392903 0.690825
C  2.225001 -0.958227 1.183839
C  -1.064682 -1.286117 1.205971
C  -1.797068 -1.442759 -1.196366
C  -1.56463 0.809816 -0.094167
H  0.789735 -1.646602 -0.975979
H  0.505573 -0.070381 -1.719782
H  2.639522 0.921715 -1.728897
H  3.141401 -0.774243 -1.445008
H  3.813093 0.53919 -0.434011
H  1.06229 2.107157 -0.080357
H  2.312391 1.816099 1.165263
H  0.620126 1.330207 1.463179
H  3.142629 -0.555161 1.653391
H  1.477442 -1.09841 1.98067
H  2.470158 -1.953165 0.7646
H  -0.545167 -2.261444 1.207123
H  -2.127583 -1.451288 1.45476
H  -0.64919 -0.651757 2.004132
H  -1.490405 -2.504475 -1.160296
H  -2.871133 -1.387792 -0.943301
H  -1.672025 -1.093883 -2.23876
H  -2.017889 2.469428 -1.250433
H  -1.206702 1.195749 -2.148332
