program: Gaussian 09
title: 000208745
version: EM64L-G09RevD.01
frameworkgroup: C1[X(C15H21N)]
method: RPBEPBE
basis: SDD
operation: Freq
keyword: #pfreq=noraman
keyword: PBEPBE/SDD
title: #p freq=noraman PBEPBE/SDD
converged: YES YES NO NO
title: Mulliken charges:
elementType: N C C C C C C C C C C C C C C C H H H H H H H H H H H H H H H H H H H H H
charge: -0.322722 0.183762 -0.155705 -0.516494 -0.482101 -0.428027 0.281628 -0.434943 -0.580328 0.293295 -0.377638 -0.381393 -0.429470 -0.698996 -0.279614 -0.247673 0.225139 0.222403 0.231953 0.195723 0.218608 0.180182 0.236846 0.201963 0.212148 0.244723 0.221487 0.220085 0.196604 0.221510 0.230954 0.233082 0.211548 0.207038 0.215568 0.223964 0.224890
chargesum: 0.00000
title: Mulliken charges with hydrogens summed into heavy atoms:
elementType: N C C C C C C C C C C C C C C C
charge: -0.077999 0.183762 0.069435 -0.062137 -0.067770 -0.010999 0.281628 -0.020833 -0.138755 0.293295 0.040476 -0.150439 -0.196388 -0.064842 -0.055650 -0.022783
polarizability: 1.86012986e+02 6.36034385e+00 1.48001104e+02 -3.31503175e+00 1.81114563e+01 1.39935251e+02
1716.lowfreq: -0.0005 -0.0004 -0.0004 8.4660 12.1819 20.2545 58.8788 64.0215 82.1653
frequency: 58.8358 63.9997 82.0549 101.6925 109.6092 155.7008 207.3356 221.0725 233.8239 242.3250 281.0265 301.0891 320.0157 360.7541 375.9834 417.5843 427.0279 468.9448 502.0952 527.4580 568.6125 599.3763 644.4261 690.9741 730.9628 739.9298 752.5105 765.8341 793.7645 830.9355 848.3076 859.8684 877.6717 892.3992 923.9635 933.5003 948.5363 971.4367 983.9223 984.5314 993.1291 1029.4162 1043.3435 1046.6374 1062.1754 1088.8308 1092.0664 1114.1576 1120.8022 1128.5969 1155.9187 1169.4069 1172.0757 1175.4021 1198.2780 1208.1631 1214.2439 1224.3792 1254.5626 1266.8540 1281.4037 1289.2279 1292.2259 1306.9123 1321.2224 1336.1949 1347.4471 1353.7526 1357.9520 1373.1869 1389.3106 1408.8036 1439.0558 1455.9791 1460.9124 1463.0178 1473.0349 1474.1542 1477.5116 1484.5615 1486.4899 1510.7499 1584.7226 1611.8820 2948.3299 2953.2560 2966.0081 2968.8407 2971.5370 2976.7182 2981.2437 2981.9029 3005.3882 3017.8037 3027.6786 3037.6191 3041.0061 3067.7616 3068.6380 3070.8082 3109.6614 3116.6177 3134.7563 3156.6638 3504.1801
redmass: 3.4962 3.0402 1.9216 2.1210 2.8886 2.7077 2.8490 2.3456 1.3289 2.2715 2.2231 2.7021 2.8580 3.2672 3.5198 2.9554 2.3284 2.9799 3.4122 3.0533 3.6153 2.8085 4.3687 2.7302 1.6143 1.8261 2.1695 1.5433 3.0553 1.5974 1.6201 1.7206 1.4983 1.9305 1.8445 2.7191 1.4955 2.4217 1.8249 1.3306 2.4676 2.5788 2.1640 1.9985 2.4637 2.5964 1.9272 2.2288 2.0843 1.6412 2.4929 1.6575 1.2098 1.2342 1.4097 1.7934 1.6768 1.8362 1.3242 1.2797 1.3644 1.2899 1.2295 1.4030 1.3955 1.5195 1.3877 1.5081 1.3430 6.3880 1.2119 1.4488 2.3546 1.1513 1.0932 1.0796 1.0934 1.0598 1.0432 2.2701 1.0844 1.0827 6.8441 6.3893 1.0577 1.0658 1.0810 1.0507 1.0466 1.0611 1.0978 1.0652 1.0639 1.0972 1.0944 1.1029 1.1016 1.1042 1.1009 1.0998 1.0865 1.0878 1.0929 1.1005 1.0765
irintensity: 0.5240 0.0309 0.0049 1.9251 0.6353 0.3470 2.0491 0.7200 1.2550 9.3145 1.1236 3.0040 10.1852 12.3087 13.1403 2.3435 19.2455 44.6531 31.7816 4.4602 3.0114 2.2180 8.3907 7.1408 18.3770 14.9658 4.6613 52.7476 0.3557 0.8796 1.7341 11.7715 3.1442 2.1866 4.6000 0.8821 1.2755 7.0763 7.6594 0.1161 1.3313 5.9752 4.5937 1.9677 0.3529 1.3727 5.8357 14.1621 3.2195 3.2387 12.8413 4.8345 3.5850 1.9882 0.8910 0.2702 6.4304 1.4163 1.6108 5.2981 9.7239 1.3479 1.1217 2.8710 2.1729 2.1600 1.0048 1.6165 2.2929 1.1034 10.9187 13.6067 3.3326 8.7334 9.5342 7.2877 15.7281 1.0790 11.6914 23.8079 9.7691 1.9968 2.3681 1.4149 128.8483 21.9083 27.0679 8.1984 45.4753 40.3282 32.8289 55.9225 33.2360 1.9664 41.7005 40.4091 29.4713 34.0008 75.5569 56.7973 14.2808 3.4134 33.3076 35.7984 0.0427
temp: 298.150 k
press: 1.00000 atm
elementType: 7 6 6 6 6 6 6 6 6 6 6 6 6 6 6 6 1 1 1 1 1 1 1 1 1 1 1 1 1 1 1 1 1 1 1 1 1
symmnumber: 1
zpe: 853203.4 jmol-1
zpe.correction: 0.324968 hartree
zpe.thermalcorrener: 0.339806 hartree
zpe.thermalcorrenthalpy: 0.340750 hartree
zpe.thermalcorrgfe: 0.283721 hartree
zpe.sumelectzpe: -637.734473 hartree
zpe.sumelectthermal: -637.719635 hartree
zpe.sumelectthermalent: -637.718691 hartree
zpe.sumelectthermalfe: -637.775720 hartree
dipole: 0.1304 -1.0872 0.0649
dipole: 1.0969
quadrupole: -97.6631 -94.2240 -94.7987
quadrupole: 2.7337 -1.5503 4.2989
quadrupole: -2.1012 1.3379 0.7632 2.7337 -1.5503 4.2989
hfenergy: -638.0594406 hartree
pointgroup: C01 [X(C15H21N1)]
dipole: -0.025905 -0.4305142 -0.0147101 debye
polarizability: 186.4675221|-4.6395309|146.5187409|-3.5208049|-18.29834|140.9630779 unknown
InChI: InChI=1S/C15H21N/c1-2-9-15-10-11-16-14(15)8-7-12-5-3-4-6-13(12)15/h3-6,14,16H,2,7-11H2,1H3
charge 0 multiplicity 1
37 atoms
N  2.811779 -1.19274 0.049479
C  0.785544 0.001533 -0.371965
C  1.504544 -0.901938 0.686382
C  1.263345 -0.661745 -1.714675
C  0.666019 -2.149638 1.060173
C  1.34792 1.46194 -0.285206
C  -0.747667 -0.016919 -0.267043
C  2.718684 -1.12356 -1.436057
C  -0.678219 -1.698318 1.666212
C  -1.442553 -0.810048 0.692012
C  0.918529 2.274639 0.957869
C  -1.508852 0.770709 -1.171003
C  -2.8598 -0.780912 0.727024
C  1.519197 3.697837 0.953573
C  -2.918056 0.79557 -1.129469
C  -3.602547 0.016556 -0.16824
H  1.666038 -0.327793 1.621709
H  1.198887 0.041299 -2.563649
H  0.616396 -1.527089 -1.946816
H  1.229089 -2.767247 1.788126
H  0.489079 -2.773106 0.161548
H  1.037711 2.021206 -1.191559
H  2.453229 1.399144 -0.312751
H  2.925658 -2.098895 -1.923458
H  3.451268 -0.39476 -1.838324
H  3.309611 -2.00271 0.430246
H  -0.476476 -1.139234 2.60513
H  -1.298911 -2.569076 1.948851
H  1.238302 1.751148 1.880608
H  -0.186063 2.337267 0.997459
H  -0.988511 1.378157 -1.9211
H  -3.383601 -1.399755 1.466906
H  2.62502 3.66222 0.938352
H  1.190158 4.264915 0.061798
H  1.210688 4.269377 1.848358
H  -3.477574 1.41405 -1.840366
H  -4.697462 0.024419 -0.12423
