program: Gaussian 09
title: 000208735
version: EM64L-G09RevD.01
frameworkgroup: C1[X(C17H14N2O3)]
method: RPBEPBE
basis: SDD
operation: Freq
keyword: #p
keyword: freq=noraman
keyword: PBEPBE/SDD
title: #p freq=noraman PBEPBE/SDD
converged: YES YES NO NO
title: Mulliken charges:
elementType: O O O N N C C C C C C C C C C C C C C C C C H H H H H H H H H H H H H H
charge: -0.248706 -0.260279 -0.234353 -0.392161 -0.509912 0.188676 0.204772 -0.522814 0.484386 0.419762 0.164615 -0.500429 -0.357467 -0.342281 0.272517 -0.437526 -0.365656 -0.244720 -0.207832 -0.217059 -0.224820 -0.238563 0.228719 0.267232 0.252596 0.280554 0.298467 0.267758 0.324684 0.231178 0.257559 0.235765 0.235997 0.228501 0.229296 0.231542
chargesum: 0.00000
title: Mulliken charges with hydrogens summed into heavy atoms:
elementType: O O O N N C C C C C C C C C C C C C C C C C
charge: -0.248706 -0.260279 -0.234353 -0.093694 -0.185228 0.188676 0.204772 -0.026863 0.484386 0.419762 0.164615 -0.247832 -0.076913 -0.074522 0.272517 -0.206348 -0.108097 -0.008955 0.028164 0.011442 0.004476 -0.007021
polarizability: 3.11802389e+02 -1.04848772e+01 2.18533644e+02 -9.41592570e-01 8.40608553e+00 1.11300510e+02
1716.lowfreq: -3.4210 -0.0010 -0.0009 -0.0007 2.6488 6.8209 11.0059 22.6927 27.8035
frequency: 10.4800 22.6775 27.7342 47.9985 55.1693 78.0614 115.2554 153.3626 171.2767 178.1997 210.0062 228.1753 269.7183 282.0254 308.8630 325.4541 400.6644 404.1106 427.4484 457.6157 477.7529 482.1691 503.3671 516.4702 531.7920 543.2281 577.2483 597.7138 616.6360 630.1062 661.6066 674.7513 686.1125 707.2500 729.7138 754.3064 758.0019 763.6494 781.2551 811.2548 842.6675 845.4809 858.3822 884.3664 913.0428 927.4996 942.9847 972.1224 981.1667 989.8916 999.0489 1001.2188 1014.6191 1023.0664 1026.4808 1067.6638 1076.0292 1090.1580 1128.0405 1162.2273 1173.4963 1185.7958 1192.3604 1199.5521 1213.4110 1227.0749 1240.7569 1249.4515 1308.8211 1323.7425 1349.3141 1356.4464 1386.7290 1398.6345 1439.8986 1442.5638 1446.7048 1460.6710 1465.1990 1481.7162 1485.8283 1561.8399 1581.1180 1595.5683 1614.7277 1620.6971 1628.8895 1666.9710 3000.6997 3063.1694 3115.3013 3124.9752 3136.1033 3139.3779 3147.7664 3152.7855 3164.5483 3166.5125 3172.0059 3178.5190 3540.3560 3550.0926
redmass: 5.3005 6.8081 4.0850 7.2908 5.5152 6.2112 5.3870 5.1792 5.4929 4.0618 6.1481 5.3331 6.3507 5.5729 5.0247 3.9684 3.1640 2.8193 3.2168 4.1338 2.6721 1.9469 5.9355 3.6211 1.4801 4.8635 4.8885 4.1909 6.3328 6.2131 3.1906 5.0690 7.8450 1.8240 5.1701 2.7328 2.2507 3.6695 1.3702 3.9314 1.7548 5.4498 1.2483 1.4513 2.3144 1.8792 4.7711 1.3671 1.3916 6.0298 1.3401 1.3283 2.5157 2.1214 2.2361 4.1392 3.3538 1.6476 1.6546 1.2239 1.0554 1.4054 1.4993 2.4003 2.6021 1.5103 1.2999 1.7918 2.4294 1.2910 6.0724 1.4509 5.5339 9.1930 1.7963 1.9582 2.6912 2.5207 1.1708 1.9387 2.0385 7.6205 7.5866 6.0475 6.0276 7.1671 8.1167 6.4653 1.0616 1.1008 1.0877 1.0864 1.0913 1.0861 1.0961 1.0905 1.1015 1.0962 1.0926 1.0991 1.0776 1.0766
irintensity: 0.1824 1.0038 0.1904 6.9315 1.4570 9.9319 3.1196 0.7631 3.3057 1.4443 0.7559 4.8377 10.2108 0.3037 0.7430 4.2293 5.5664 0.3351 0.2715 5.8973 46.4466 31.2535 22.0704 3.2878 129.6890 23.3120 27.5676 27.2880 0.6787 3.6176 3.2517 0.4922 29.0652 52.9906 2.3642 3.5142 59.3554 7.2790 101.8843 9.2873 40.8252 16.1563 0.2458 0.6043 3.0479 9.8383 22.2828 3.0232 0.3195 0.1283 2.5836 0.2547 24.2670 7.5269 11.9352 18.0458 5.2104 25.2303 41.9243 1.0431 0.0995 269.5339 216.8921 72.6719 7.1757 19.0381 102.5625 4.0267 27.8788 10.1791 683.5952 49.9930 2.0356 21.4304 77.8816 25.1080 41.9829 39.8786 32.2354 392.3016 82.4219 101.9108 36.5756 0.9445 18.4618 144.0916 519.7731 252.7110 47.0211 5.2313 8.9816 0.6105 10.3546 4.0102 35.7980 4.5946 23.3446 16.7583 5.8917 10.5771 17.0627 48.5313
temp: 298.150 k
press: 1.00000 atm
elementType: 8 8 8 7 7 6 6 6 6 6 6 6 6 6 6 6 6 6 6 6 6 6 1 1 1 1 1 1 1 1 1 1 1 1 1 1
symmnumber: 1
zpe: 721797.0 jmol-1
zpe.correction: 0.274918 hartree
zpe.thermalcorrener: 0.293368 hartree
zpe.thermalcorrenthalpy: 0.294313 hartree
zpe.thermalcorrgfe: 0.224651 hartree
zpe.sumelectzpe: -989.863111 hartree
zpe.sumelectthermal: -989.844661 hartree
zpe.sumelectthermalent: -989.843717 hartree
zpe.sumelectthermalfe: -989.913378 hartree
dipole: 5.4826 0.7223 -1.7843
dipole: 5.8107
quadrupole: -127.9999 -111.7178 -135.4998
quadrupole: -25.2013 -9.9703 -0.0231
quadrupole: -2.9274 13.3547 -10.4273 -25.2013 -9.9703 -0.0231
hfenergy: -990.1380294 hartree
pointgroup: C01 [X(C17H14N2O3)]
dipole: -2.1505251 -0.1672433 -0.7573498 debye
polarizability: 312.0422045|-9.443865|217.4478275|-0.0178193|12.6360787|112.1465107 unknown
InChI: InChI=1S/C17H14N2O3/c20-14-10-16(22-15-9-5-4-8-13(14)15)19-17(21)18-11-12-6-2-1-3-7-12/h1-10,18-19H,11H2
charge 0 multiplicity 1
36 atoms
O  1.52759 -0.119366 0.118345
O  4.878252 2.351304 -0.375152
O  -0.757502 0.16055 1.828989
N  -2.202692 1.515481 0.572881
N  0.099756 1.698193 0.228669
C  3.972476 0.106511 -0.16658
C  2.817988 -0.693977 0.020349
C  -3.431437 1.051797 1.245927
C  -4.300577 0.165792 0.357749
C  1.4245 1.263819 0.137337
C  3.863124 1.595739 -0.206482
C  2.509545 2.106095 -0.004196
C  5.225089 -0.548197 -0.288864
C  2.875253 -2.100039 0.09379
C  -0.951277 1.036659 0.947022
C  -5.64306 0.517964 0.077241
C  -3.772279 -1.032302 -0.189936
C  5.307469 -1.950139 -0.224829
C  4.131111 -2.724879 -0.03118
C  -6.449897 -0.311607 -0.736572
C  -4.575153 -1.860436 -1.003087
C  -5.916942 -1.502325 -1.279494
H  -4.010964 1.927666 1.593514
H  -3.090385 0.493885 2.136683
H  2.373028 3.189606 0.048275
H  6.109959 0.081498 -0.429338
H  -2.306958 2.01739 -0.311181
H  1.954456 -2.668666 0.250046
H  -0.070936 2.653837 -0.089711
H  -6.061247 1.44121 0.498431
H  -2.736005 -1.314005 0.032671
H  6.277442 -2.448831 -0.320125
H  4.197564 -3.816641 0.024126
H  -7.487769 -0.029318 -0.945913
H  -4.16003 -2.786202 -1.417057
H  -6.539693 -2.146562 -1.91015
