program: Gaussian 09
title: 000208749
version: EM64L-G09RevD.01
frameworkgroup: C1[X(C20H14N2O4)]
method: RPBEPBE
basis: SDD
operation: Freq
keyword: #p
keyword: freq=noraman
keyword: PBEPBE/SDD
title: #p freq=noraman PBEPBE/SDD
converged: YES YES NO NO
title: Mulliken charges:
elementType: O O O O N N C C C C C C C C C C C C C C C C C C C C H H H H H H H H H H H H H H
charge: -0.330927 -0.293175 -0.204446 -0.199274 -0.010626 0.023609 0.138267 0.251948 0.181169 -0.055737 -0.093820 0.204493 -0.342703 -0.467630 -0.334227 0.404742 -0.361196 -0.399506 -0.206467 0.458185 -0.337277 -0.404325 -0.519579 -0.209923 -0.197389 -0.253030 0.275635 0.320257 0.275369 0.257695 0.288678 0.239867 0.254100 0.253146 0.242590 0.219008 0.240733 0.229655 0.230549 0.231561
chargesum: 0.00000
title: Mulliken charges with hydrogens summed into heavy atoms:
elementType: O O O O N N C C C C C C C C C C C C C C C C C C C C
charge: -0.330927 -0.293175 -0.204446 -0.199274 -0.010626 0.023609 0.138267 0.251948 0.181169 -0.055737 -0.093820 0.204493 -0.067067 -0.147373 -0.058858 0.404742 -0.103501 -0.110828 0.033400 0.458185 -0.083177 -0.151179 0.182752 0.019733 0.033160 -0.021469
polarizability: 3.80032754e+02 -2.84320369e+01 2.99819850e+02 4.01439297e+00 3.29785933e+01 1.56279762e+02
1716.lowfreq: -7.1225 -5.1596 -0.0007 -0.0005 0.0003 1.0174 12.9349 33.6178 40.0669
frequency: 12.7024 33.5974 40.0262 47.2252 53.0494 87.2815 100.2114 109.3020 130.6776 153.8180 166.0277 181.8236 194.7018 217.9534 253.8563 264.6234 290.5351 315.7787 325.7296 337.6160 395.5490 409.8254 418.9680 439.2211 481.9418 490.1313 498.4061 504.3500 514.7427 524.8608 569.0816 578.4070 584.0183 612.3705 637.8307 652.1481 673.3089 678.9808 688.6638 710.0878 738.4282 748.1765 756.0288 766.9135 785.1961 795.3755 827.9265 829.1186 853.8128 886.2966 898.2678 906.5967 918.9222 944.4986 946.0772 965.8775 986.0497 987.2245 990.5072 999.9316 1017.3261 1025.0109 1045.3366 1060.8677 1075.3076 1079.6340 1107.3817 1139.6555 1148.9067 1163.0909 1165.2061 1171.9057 1188.4910 1205.8754 1209.5084 1239.2270 1253.2598 1292.2251 1310.1738 1313.6222 1336.1980 1361.3658 1374.6754 1388.5289 1396.7930 1426.3872 1432.8900 1444.0693 1453.4881 1457.6200 1461.0384 1470.6295 1473.3122 1534.5005 1546.4153 1556.2889 1599.0061 1600.8270 1609.4036 1626.7553 2967.9377 3065.4454 3124.7098 3133.0033 3140.6972 3146.1792 3155.0331 3162.2434 3166.2432 3170.0437 3173.8135 3181.2768 3191.4860 3193.6463
redmass: 6.1379 5.0474 4.0875 10.3401 6.4510 5.2701 5.3374 3.5040 3.7974 1.3796 3.1310 4.3149 4.9619 6.3354 6.4957 5.8474 9.7210 6.4620 5.4469 6.6002 7.6905 2.9119 5.8745 3.6630 3.4927 5.9366 4.3557 6.3187 5.9153 7.3773 5.6924 7.3143 6.5750 6.5903 5.2921 6.3375 7.7682 5.1461 2.2956 6.7852 2.8774 4.3770 1.7048 9.8578 2.9015 3.8872 1.2630 2.1860 1.8867 5.7665 1.4210 4.9553 1.6060 4.6968 1.6089 1.3665 4.8775 1.3835 1.3337 1.3128 2.7342 3.4257 3.3653 2.2139 2.1833 1.5097 1.2381 1.5294 1.3190 1.4524 1.3129 1.1524 1.8636 2.6901 4.2719 2.0819 2.5440 6.2849 1.4562 3.2182 2.2350 5.8714 6.2362 9.1783 4.8470 2.0238 2.4291 2.2890 2.5704 1.1556 2.8412 1.0985 2.0870 8.3806 8.0955 8.7139 6.4196 6.5860 6.8017 7.2892 1.0317 1.1035 1.1016 1.0849 1.0887 1.0874 1.0924 1.0965 1.0925 1.0886 1.1015 1.0988 1.0932 1.0964
irintensity: 0.2312 0.6133 0.3776 0.2851 0.4368 1.3654 2.6441 2.4820 4.7922 0.9355 1.2743 0.0560 1.6587 3.4214 2.6961 1.4089 0.0186 3.3775 7.8151 0.4340 8.7376 0.0510 2.0645 3.4303 6.3891 3.3853 2.0088 9.6554 0.5035 3.6831 1.2597 0.0259 1.4674 1.3506 4.6773 5.9999 9.3641 17.3947 19.3187 21.6871 19.0637 9.7076 93.5725 21.1308 20.7819 5.1332 2.1402 55.0988 15.0252 6.4721 3.7590 18.2974 3.2346 16.9386 16.0688 0.2229 4.5319 0.5822 1.4359 0.4087 15.5592 115.8533 35.7457 31.9954 8.5754 11.3976 2.4601 16.8221 9.4199 68.9584 72.3871 43.0792 175.9778 59.1983 380.7032 27.4501 61.1855 25.8813 26.1411 171.0687 9.6845 21.6444 98.9408 11.5960 70.9875 0.3015 32.7509 3.8521 23.4064 8.4998 89.0450 29.8098 55.8703 24.3180 50.5764 63.4377 43.1133 8.9832 35.0625 29.3491 66.8762 27.6104 21.7105 2.7878 6.8369 10.1036 24.0107 16.4057 5.1459 5.4750 12.1116 13.1684 4.1524 5.6007
temp: 298.150 k
press: 1.00000 atm
elementType: 8 8 8 8 7 7 6 6 6 6 6 6 6 6 6 6 6 6 6 6 6 6 6 6 6 6 1 1 1 1 1 1 1 1 1 1 1 1 1 1
symmnumber: 1
zpe: 769465.7 jmol-1
zpe.correction: 0.293074 hartree
zpe.thermalcorrener: 0.314297 hartree
zpe.thermalcorrenthalpy: 0.315241 hartree
zpe.thermalcorrgfe: 0.240810 hartree
zpe.sumelectzpe: -1179.032246 hartree
zpe.sumelectthermal: -1179.011023 hartree
zpe.sumelectthermalent: -1179.010079 hartree
zpe.sumelectthermalfe: -1179.084510 hartree
dipole: -7.4224 0.7254 -1.1873
dipole: 7.5517
quadrupole: -181.4434 -136.4733 -140.2879
quadrupole: 3.4693 1.9368 0.8258
quadrupole: -28.7086 16.2616 12.4469 3.4693 1.9368 0.8258
hfenergy: -1179.32532 hartree
pointgroup: C01 [X(C20H14N2O4)]
dipole: -2.9462035 -0.0162906 0.3830949 debye
polarizability: 384.5752834|19.1435288|292.9918909|6.2370908|37.8701687|158.5651919 unknown
InChI: InChI=1S/C20H14N2O4/c1-25-18-9-5-8-16-19(18)20(26-14-6-3-2-4-7-14)15-11-10-13(22(23)24)12-17(15)21-16/h2-12H,1H3
charge 0 multiplicity 1
40 atoms
O  -1.070605 0.957789 0.991623
O  -3.337512 -0.689601 0.615328
O  5.878711 1.39719 0.554393
O  6.015266 -0.7364 -0.240935
N  1.261368 -2.304875 -0.487793
N  5.344264 0.28045 0.183388
C  -0.986889 -1.359854 0.090115
C  1.054932 0.003097 0.405107
C  -0.359291 -0.135833 0.462042
C  1.831365 -1.131988 -0.074824
C  -0.101366 -2.423007 -0.41625
C  -2.408676 -1.643337 0.151376
C  1.733198 1.209686 0.795882
C  3.260911 -1.019144 -0.139393
C  -0.668349 -3.662187 -0.876492
C  3.863445 0.169985 0.253597
C  -2.91138 -2.85625 -0.317398
C  3.11647 1.301252 0.725228
C  -2.042293 -3.866933 -0.841954
C  -1.819427 1.823787 0.139404
C  -1.811494 1.71686 -1.266728
C  -2.543708 2.836731 0.801607
C  -3.468042 -0.590442 2.084888
C  -2.559797 2.649309 -2.020113
C  -3.284847 3.759334 0.03319
C  -3.298116 3.670026 -1.379368
H  1.136715 2.050875 1.158426
H  3.848378 -1.867432 -0.497717
H  0.028645 -4.416599 -1.250788
H  -3.993384 -3.015073 -0.272483
H  3.655272 2.205093 1.018365
H  -2.471121 -4.807741 -1.202153
H  -1.243286 0.927224 -1.768043
H  -2.517233 2.890879 1.894311
H  -2.521946 -0.25137 2.544653
H  -3.77438 -1.566282 2.509009
H  -4.255633 0.158765 2.254229
H  -2.562223 2.573595 -3.112957
H  -3.850369 4.549221 0.539462
H  -3.874676 4.387799 -1.971837
