program: Gaussian 09
title: 000208743
version: EM64L-G09RevD.01
frameworkgroup: C1[X(C16H23N)]
method: RPBEPBE
basis: SDD
operation: Freq
keyword: #pfreq=noraman
keyword: PBEPBE/SDD
title: #p freq=noraman PBEPBE/SDD
converged: YES YES NO NO
title: Mulliken charges:
elementType: N C C C C C C C C C C C C C C C C H H H H H H H H H H H H H H H H H H H H H H H
charge: -0.087474 0.202419 -0.121011 -0.510746 -0.454748 -0.433558 -0.454920 0.297863 -0.601604 0.320369 -0.370708 -0.647948 -0.376613 -0.443126 -0.699119 -0.285701 -0.242952 0.188942 0.207215 0.237618 0.199883 0.229590 0.230997 0.176207 0.192718 0.206987 0.218411 0.219265 0.189788 0.225701 0.224347 0.188418 0.226518 0.229960 0.234018 0.207342 0.210689 0.217822 0.223041 0.224099
chargesum: 0.00000
title: Mulliken charges with hydrogens summed into heavy atoms:
elementType: N C C C C C C C C C C C C C C C C
charge: -0.087474 0.202419 0.067931 -0.065913 -0.025275 -0.026354 -0.055215 0.297863 -0.163928 0.320369 0.044781 -0.008665 -0.146653 -0.209109 -0.063265 -0.062660 -0.018853
polarizability: 2.04584397e+02 -4.69482086e+00 1.45048351e+02 2.53937773e+00 1.44083642e+01 1.59689842e+02
1716.lowfreq: -9.3436 -0.0006 0.0002 0.0005 13.9617 16.2952 32.8618 62.0982 80.5245
frequency: 32.7813 62.0426 80.4979 96.5619 123.7211 153.7404 186.8539 199.6496 220.6328 233.1472 238.1311 275.1049 279.2946 293.3566 306.7409 340.7046 384.5713 398.1057 439.1243 463.6221 494.9298 520.7187 570.4821 575.0020 606.4291 636.0244 697.3257 741.5118 745.9557 768.0337 790.6469 803.8864 843.2599 864.6706 876.2023 882.1776 903.4140 917.3568 948.3005 974.4576 981.0078 982.5326 984.7258 1025.8731 1040.3847 1045.2245 1049.3321 1060.4595 1095.8934 1100.1151 1103.4693 1112.7375 1127.0954 1141.7596 1152.9994 1167.6086 1174.2148 1192.9119 1202.3797 1206.9470 1216.5924 1223.2182 1245.6018 1257.6610 1281.3997 1285.7410 1294.9078 1299.1263 1315.1540 1327.3458 1338.2883 1345.4070 1351.5971 1358.5583 1376.0258 1391.5174 1433.7848 1437.7790 1455.1372 1456.9158 1463.2816 1465.9241 1471.8645 1475.4027 1476.2614 1478.5041 1486.2480 1487.4490 1500.7218 1585.8523 1611.5491 2838.2901 2847.1889 2874.8534 2955.2847 2958.1514 2970.9712 2972.9386 2990.4813 3002.0584 3007.0485 3012.5495 3016.5872 3033.0029 3034.8802 3055.1172 3068.0869 3069.1395 3070.9977 3074.8967 3110.9343 3118.9995 3135.1496 3156.2738
redmass: 3.2840 2.9819 2.5923 2.2602 2.8392 2.6414 2.8310 1.5392 1.7236 2.0063 1.2476 2.0694 3.1428 2.7037 2.6843 2.7499 4.0974 2.8353 3.3714 2.8782 3.7012 3.0592 3.2883 3.5305 2.9701 4.0597 3.0971 1.4610 1.5546 1.6561 3.3348 2.3086 1.6139 1.7329 1.5925 1.7688 2.5110 1.7604 1.4300 2.2063 1.8742 2.3152 1.3508 2.3260 2.3939 1.8294 1.9568 2.5184 1.7620 1.6854 1.6613 2.1038 1.8233 2.3798 1.4278 1.6983 1.0725 1.9316 1.4612 2.1180 2.2720 1.7830 1.8529 1.4098 1.3849 1.3171 1.2795 1.4209 1.3623 1.6845 1.4404 1.4341 1.4772 1.4946 6.1435 1.2113 1.1922 2.1999 1.1359 1.0978 1.0997 1.0871 1.0607 1.0583 1.0585 1.0433 2.0409 1.1383 1.0902 6.8722 6.3116 1.0635 1.0671 1.0812 1.0660 1.0583 1.0362 1.0610 1.0612 1.0721 1.0971 1.0714 1.0757 1.1014 1.0939 1.1026 1.1009 1.1005 1.0992 1.1048 1.0862 1.0876 1.0933 1.1005
irintensity: 0.1778 0.0231 0.1322 0.3856 0.2173 0.2731 0.1301 2.1782 4.6247 0.9307 0.4092 0.5031 0.0484 2.1828 1.5041 0.7082 0.0783 0.8026 0.7219 5.9366 2.3835 1.2617 1.2561 6.7427 3.1606 3.1045 1.1512 7.8037 21.9570 45.6955 1.1595 13.0197 3.4506 5.3074 1.1876 2.6145 4.3389 4.2923 0.3372 2.9180 3.9239 6.7729 0.2157 0.2809 7.1726 12.9003 11.5520 1.5462 8.8584 1.1586 9.2269 3.0497 1.6186 4.6423 9.4468 2.9106 0.2396 17.5731 1.3580 0.7427 13.0436 0.0953 22.3827 2.0144 4.8515 1.0656 0.9483 0.8884 6.9089 1.2578 0.8857 2.6484 3.3646 6.4088 1.4265 10.8224 2.4289 3.5352 7.9096 13.3169 2.9649 4.3025 28.7327 3.7379 6.8893 12.6639 22.7198 8.5581 5.8259 2.0480 1.2050 56.9627 161.7081 107.0322 27.9889 18.6344 59.4477 33.8044 37.3640 21.1032 12.6632 54.4641 66.7040 22.2678 39.1622 36.5366 76.2046 28.0007 46.8203 32.8981 11.1906 3.9231 35.6681 35.8471
temp: 298.150 k
press: 1.00000 atm
elementType: 7 6 6 6 6 6 6 6 6 6 6 6 6 6 6 6 6 1 1 1 1 1 1 1 1 1 1 1 1 1 1 1 1 1 1 1 1 1 1 1
symmnumber: 1
zpe: 924028.7 jmol-1
zpe.correction: 0.351944 hartree
zpe.thermalcorrener: 0.368112 hartree
zpe.thermalcorrenthalpy: 0.369056 hartree
zpe.thermalcorrgfe: 0.309002 hartree
zpe.sumelectzpe: -676.952555 hartree
zpe.sumelectthermal: -676.936387 hartree
zpe.sumelectthermalent: -676.935443 hartree
zpe.sumelectthermalfe: -676.995498 hartree
dipole: -0.6329 0.7747 -0.3401
dipole: 1.0566
quadrupole: -99.6196 -107.6382 -99.5823
quadrupole: -1.7164 0.6557 4.0317
quadrupole: 2.6604 -5.3582 2.6978 -1.7164 0.6557 4.0317
hfenergy: -677.3044993 hartree
pointgroup: C01 [X(C16H23N1)]
dipole: 0.259023 -0.2989431 -0.1278438 debye
polarizability: 204.8447358|-2.8554132|144.5347168|-1.5916142|-14.3526328|159.9431368 unknown
InChI: InChI=1S/C16H23N/c1-3-10-16-11-12-17(2)15(16)9-8-13-6-4-5-7-14(13)16/h4-7,15H,3,8-12H2,1-2H3
charge 0 multiplicity 1
40 atoms
N  2.658114 1.022875 0.258595
C  0.554129 -0.216302 0.482917
C  1.490516 0.541099 -0.540231
C  1.147598 0.211904 1.870987
C  0.80153 1.710539 -1.276508
C  2.650591 0.379064 1.588847
C  0.730128 -1.770492 0.323871
C  -0.938162 0.128109 0.357463
C  -0.532608 1.244021 -1.895989
C  -1.471612 0.771844 -0.795817
C  0.196566 -2.391116 -0.987637
C  3.949346 1.040801 -0.436917
C  -1.828592 -0.262513 1.391377
C  -2.867041 1.001861 -0.884878
C  0.380977 -3.924245 -1.018374
C  -3.217501 -0.033933 1.29491
C  -3.74383 0.599024 0.145226
H  1.826651 -0.191117 -1.314079
H  0.946529 -0.532383 2.661936
H  0.716533 1.179833 2.18331
H  1.479528 2.107476 -2.056955
H  0.618156 2.525643 -0.552191
H  3.154593 1.021943 2.335309
H  3.171961 -0.612575 1.595695
H  0.211814 -2.2628 1.172765
H  1.807013 -2.017938 0.426009
H  -0.334604 0.420214 -2.614598
H  -1.005374 2.059243 -2.474302
H  0.717188 -1.945881 -1.859434
H  -0.876434 -2.144471 -1.101565
H  3.86883 1.614634 -1.377564
H  4.333529 0.018434 -0.689194
H  4.707608 1.540556 0.193674
H  -1.429376 -0.752556 2.287675
H  -3.265785 1.508472 -1.772973
H  1.449289 -4.201568 -0.935352
H  -0.155592 -4.404554 -0.178167
H  -0.008432 -4.35777 -1.957899
H  -3.883018 -0.343715 2.108678
H  -4.820459 0.784345 0.058081
