program: Gaussian 09
title: 000208728
version: EM64L-G09RevD.01
frameworkgroup: C1[X(C14H27NO)]
method: RPBEPBE
basis: SDD
operation: Freq
keyword: #p
keyword: freq=noraman
keyword: PBEPBE/SDD
title: #p freq=noraman PBEPBE/SDD
converged: YES YES NO NO
title: Mulliken charges:
elementType: O N C C C C C C C C C C C C C C H H H H H H H H H H H H H H H H H H H H H H H H H H H
charge: -0.304104 -0.141859 0.187313 -0.418548 0.295310 0.210784 -0.399810 -0.392174 -0.732260 -0.723992 -0.376130 -0.380158 -0.404515 -0.725663 -0.729168 -0.717244 0.198429 0.192636 0.199573 0.273287 0.213168 0.210039 0.208122 0.229937 0.220487 0.193740 0.238133 0.221878 0.202335 0.211187 0.202018 0.201873 0.221745 0.188724 0.201829 0.204808 0.240113 0.204214 0.211223 0.213703 0.248228 0.199372 0.201417
chargesum: 0.00000
title: Mulliken charges with hydrogens summed into heavy atoms:
elementType: O N C C C C C C C C C C C C C C
charge: -0.304104 -0.141859 0.187313 -0.027483 0.295310 0.210784 0.073050 0.031033 -0.073714 -0.070241 0.037392 0.023733 0.005954 -0.078913 -0.100028 -0.068228
polarizability: 1.79358219e+02 -6.83159247e+00 1.52052957e+02 -2.57131922e+00 2.41551680e+00 1.44148020e+02
1716.lowfreq: -14.2929 -10.2826 -0.0007 -0.0007 0.0003 8.5166 43.8381 51.7504 56.1312
frequency: 43.8180 51.4135 55.4946 77.5420 104.9266 146.1724 166.6028 193.1643 205.0978 217.6367 220.2397 242.7878 262.9709 266.5966 274.9692 283.5759 304.7835 327.5439 333.4397 358.8423 374.7733 398.7170 404.8131 417.5958 423.6124 441.7878 489.5676 506.3603 539.4928 575.3887 658.3794 718.0434 736.1565 797.6513 805.2640 825.0232 846.9208 861.1348 878.7776 909.6463 921.0484 928.5998 934.2400 940.0466 943.0064 946.0166 974.1549 999.8835 1008.9916 1025.5047 1030.9752 1042.6750 1086.8519 1106.9898 1117.3378 1131.0396 1139.7275 1153.2851 1194.3238 1196.2858 1216.7187 1231.4309 1244.8339 1250.3656 1254.6956 1271.5012 1318.8801 1323.3660 1336.3127 1336.9957 1341.8483 1343.7365 1351.3624 1371.3694 1378.7758 1380.7503 1390.0444 1401.9821 1407.2254 1442.9814 1451.5387 1455.9837 1458.7804 1461.9208 1463.3052 1465.7512 1467.2809 1470.6216 1471.8447 1475.9722 1480.3317 1484.6880 1486.5292 1495.1902 1500.9857 1541.3210 2942.7279 2953.2023 2956.8031 2959.6712 2968.0511 2969.9750 2975.5683 2979.3344 2980.7679 2985.5727 2991.8820 3027.8402 3034.3316 3041.6575 3051.8591 3052.4045 3056.0176 3056.6792 3065.0301 3070.0162 3081.7238 3084.7884 3087.4755 3094.1654 3103.7594 3118.9549 3138.7820
redmass: 3.5459 2.8331 3.2524 3.5561 3.5700 2.5044 1.4669 1.5645 1.5967 2.6708 1.4695 1.6407 1.8851 1.2588 1.1750 1.6306 1.7926 2.4545 2.2640 2.5457 2.2669 3.0707 2.1269 1.8704 2.5116 2.6811 2.4237 2.5743 2.7358 2.6451 3.6708 5.7455 3.5900 2.0300 2.0642 2.5532 1.4756 2.0801 2.4002 2.2721 1.9902 1.7279 1.8568 1.4449 1.2616 1.3357 1.8177 1.5710 1.8552 1.4229 1.4084 1.9810 1.3879 1.9009 2.4734 2.1995 1.8479 1.3174 2.4006 2.0349 2.7906 2.7642 2.3234 3.0916 1.3200 1.1986 1.4621 1.2531 1.3804 1.3460 1.4566 1.5187 1.3583 1.1935 1.2078 1.2023 1.5969 1.2412 1.5051 1.0799 1.0636 1.0893 1.0540 1.0870 1.0748 1.0969 1.0641 1.0670 1.0673 1.0965 1.0591 1.0887 1.0652 1.0693 1.0588 5.1442 1.0729 1.0699 1.0493 1.0484 1.0632 1.0369 1.0389 1.0603 1.0365 1.0615 1.0376 1.0942 1.0964 1.1023 1.1023 1.1004 1.0989 1.0992 1.0983 1.0993 1.0996 1.0990 1.0987 1.0925 1.0958 1.0973 1.0871
irintensity: 0.6950 0.0887 0.1589 1.4279 2.2874 0.2431 0.2499 0.1965 0.4138 0.9380 0.2122 0.3451 1.6510 0.3221 0.1238 0.6299 0.4250 0.5763 0.3580 1.0878 0.3146 5.5396 3.9851 2.9648 2.4340 0.1498 2.5939 1.4196 7.4360 2.4992 2.5240 2.8273 0.2231 0.8965 0.4722 5.1934 16.6132 0.9393 2.4465 6.9778 1.4791 2.4768 0.2448 1.4675 0.6028 6.0466 9.1886 29.8426 20.7361 0.2943 0.5892 0.6679 1.1847 38.4970 5.4284 15.8347 2.7216 2.1926 35.4652 70.8472 24.0865 15.5705 12.4874 13.6460 1.7564 12.9381 0.4519 3.0928 2.4266 3.6541 6.8522 5.0463 12.4428 12.1729 37.0486 17.7281 12.2158 36.1659 60.1758 5.6359 6.4855 7.3098 4.6077 6.3298 5.6965 25.3136 2.9512 5.7101 13.0334 12.9146 3.6326 7.6737 10.4933 35.3820 29.3520 172.6684 37.0206 62.2368 15.7166 50.2702 50.7537 34.0072 30.1838 31.6216 29.7731 30.5979 33.9970 31.9811 56.8557 37.5942 76.9833 56.8584 40.7543 10.7241 106.9786 29.2392 42.3096 18.6846 45.8882 6.9468 26.3421 23.1562 17.0912
temp: 298.150 k
press: 1.00000 atm
elementType: 8 7 6 6 6 6 6 6 6 6 6 6 6 6 6 6 1 1 1 1 1 1 1 1 1 1 1 1 1 1 1 1 1 1 1 1 1 1 1 1 1 1 1
symmnumber: 1
zpe: 1014576.6 jmol-1
zpe.correction: 0.386432 hartree
zpe.thermalcorrener: 0.404960 hartree
zpe.thermalcorrenthalpy: 0.405904 hartree
zpe.thermalcorrgfe: 0.341516 hartree
zpe.sumelectzpe: -678.354177 hartree
zpe.sumelectthermal: -678.335649 hartree
zpe.sumelectthermalent: -678.334705 hartree
zpe.sumelectthermalfe: -678.399093 hartree
dipole: -1.4083 1.8805 3.0823
dipole: 3.8756
quadrupole: -94.4150 -105.4713 -104.8490
quadrupole: -0.6625 -0.1149 -5.8386
quadrupole: 7.1635 -3.8929 -3.2706 -0.6625 -0.1149 -5.8386
hfenergy: -678.740609 hartree
pointgroup: C01 [X(C14H27N1O1)]
dipole: 0.6670756 0.6535693 -1.2053269 debye
polarizability: 180.2741848|5.2307617|151.1475596|-0.8370713|-2.2653567|144.1374514 unknown
InChI: InChI=1S/C14H27NO/c1-13(2,3)11-14(4,5)12(16)15-9-7-6-8-10-15/h6-11H2,1-5H3
charge 0 multiplicity 1
43 atoms
O  -0.027719 -1.673448 1.673043
N  1.382272 -0.793938 0.076007
C  -1.127183 -1.188982 -0.474362
C  -1.519342 0.247965 -0.982503
C  -2.072661 1.368611 -0.027641
C  0.113888 -1.219598 0.488104
C  2.50362 -0.886847 1.049419
C  1.815424 -0.241074 -1.225814
C  -0.856557 -2.095097 -1.722353
C  -2.304473 -1.858859 0.286699
C  3.141633 0.499363 1.290788
C  2.442247 1.165462 -1.058888
C  3.605956 1.135343 -0.040497
C  -3.572832 1.160158 0.324445
C  -1.965283 2.704143 -0.823264
C  -1.249289 1.507531 1.279296
H  -2.284378 0.09288 -1.773681
H  -0.645086 0.685631 -1.500787
H  3.266341 -1.583809 0.64026
H  2.097595 -1.317314 1.977487
H  0.977947 -0.20135 -1.930701
H  2.578658 -0.924285 -1.659411
H  -0.169431 -1.649317 -2.46141
H  -0.437528 -3.068887 -1.40959
H  -1.813457 -2.291059 -2.241304
H  -3.231235 -1.766708 -0.309307
H  -2.460133 -1.413223 1.279932
H  -2.09321 -2.929742 0.451455
H  3.995062 0.388943 1.987017
H  2.397713 1.155193 1.783864
H  1.66031 1.869913 -0.711644
H  2.796032 1.522525 -2.045609
H  3.998477 2.155637 0.12925
H  4.44057 0.535171 -0.4597
H  -4.182766 1.036542 -0.591226
H  -3.957818 2.043723 0.868954
H  -3.735509 0.278281 0.963863
H  -0.909555 2.954396 -1.044587
H  -2.50955 2.642856 -1.785676
H  -2.397428 3.540779 -0.242671
H  -1.314107 0.603707 1.908625
H  -0.179456 1.688183 1.060937
H  -1.622657 2.364704 1.871883
