program: Gaussian 09
title: 000208701
version: EM64L-G09RevD.01
frameworkgroup: C1[X(C19H21ClN2OS)]
method: RPBEPBE
basis: SDD
operation: Freq
keyword: #p
keyword: freq=noraman
keyword: PBEPBE/SDD
title: #p freq=noraman PBEPBE/SDD
converged: NO YES NO NO
title: Mulliken charges:
elementType: Cl S O N N C C C C C C C C C C C C C C C C C C C H H H H H H H H H H H H H H H H H H H H H
charge: -0.056217 0.148544 -0.457623 -0.108174 0.040772 -0.166066 -0.365499 -0.353515 -0.386414 -0.389731 -0.639755 0.601334 -0.563425 0.629995 -0.374716 -0.423642 -0.320273 -0.430817 -0.245771 -0.109707 -0.281377 -0.238716 -0.249619 -0.244223 0.210556 0.239676 0.228870 0.226330 0.238627 0.217539 0.238997 0.239730 0.215576 0.234793 0.253165 0.200479 0.254128 0.255156 0.269806 0.232893 0.257504 0.245928 0.260621 0.231679 0.232580
chargesum: 0.00000
title: Mulliken charges with hydrogens summed into heavy atoms:
elementType: Cl S O N N C C C C C C C C C C C C C C C C C C C
charge: -0.056217 0.148544 -0.457623 -0.108174 0.040772 0.044490 0.103047 0.111443 0.070123 0.065575 -0.151798 0.601334 0.146338 0.629995 -0.374716 -0.153836 -0.320273 -0.197924 0.011733 -0.109707 -0.035449 0.021905 -0.017940 -0.011643
polarizability: 3.25869820e+02 -5.48835650e+01 2.18653330e+02 -7.50007647e+00 -1.94187612e+01 2.08505757e+02
1716.lowfreq: -6.9728 -0.0007 -0.0004 0.0009 4.9809 10.1156 19.7075 27.6656 47.8191
frequency: 18.9582 27.4018 47.5944 55.0325 81.0640 87.0042 115.4420 144.8676 177.7244 192.5352 207.4575 220.0716 226.6162 238.6713 243.3208 259.2980 281.9323 305.6010 310.4912 342.4193 354.4595 374.4423 385.5915 420.1704 430.9469 438.7126 445.8791 451.5211 486.3044 491.1724 503.9014 506.2353 553.6970 579.6806 614.8902 618.9979 649.8794 666.9400 676.1426 690.1100 719.3152 742.3632 756.5737 764.4676 769.9405 820.2803 829.9646 840.0301 847.9859 869.5867 895.0851 899.8596 934.1228 940.6819 952.9472 958.9633 974.9028 981.1477 1001.2836 1024.4546 1027.8246 1036.0993 1044.0169 1060.0633 1074.6884 1091.1900 1103.2733 1122.0195 1124.0086 1128.5611 1139.2579 1150.3125 1174.1909 1179.8409 1183.6301 1206.5115 1214.1505 1231.0273 1248.5712 1252.0716 1261.4468 1284.5364 1293.9599 1304.3547 1330.8282 1337.4420 1350.4681 1358.3754 1359.0036 1366.7788 1377.2751 1381.0199 1403.0910 1404.9947 1419.8563 1425.3637 1442.7003 1445.4747 1445.9679 1455.1631 1462.9518 1464.9776 1465.7992 1480.0666 1567.7431 1578.7458 1586.4653 1599.4272 2827.9842 2915.3466 2918.7564 2986.0954 2989.7454 3005.1831 3014.4207 3039.2055 3062.2171 3070.3550 3102.1529 3104.7245 3112.6248 3112.8315 3125.4006 3143.2078 3145.1368 3145.1425 3148.3210 3164.7830 3175.9963
redmass: 7.7802 5.4991 3.6257 5.5007 5.6374 5.0125 5.2076 8.3013 4.0192 5.2470 4.7381 1.0600 3.7254 3.0131 3.7251 4.5583 3.3565 5.8005 3.1710 2.9268 4.0827 5.3626 3.5129 2.1743 3.5440 3.5765 3.4118 3.4336 4.8588 3.5296 4.0325 4.2438 5.1184 5.4681 3.0105 4.9806 6.2062 4.6431 3.5881 4.1474 3.9850 2.6283 1.5160 3.6836 2.1697 1.3507 4.0885 5.7966 2.6005 1.7333 1.6081 1.7701 2.0743 1.7052 1.3510 1.9635 2.7248 1.3413 2.1869 2.6215 4.4023 4.5297 2.5096 2.2128 1.7190 1.9953 2.4408 1.8999 2.3451 1.6341 2.8784 1.8053 1.1739 1.9281 1.4340 1.6564 1.5612 1.4512 1.5565 1.2974 1.3118 1.3373 1.3134 1.2743 1.5674 1.2796 1.4496 1.8234 1.3048 5.1553 2.8790 1.8406 1.7394 1.3780 2.0015 1.0854 1.0793 1.0574 1.1019 2.2202 1.0821 1.2898 1.3332 1.4578 6.8168 6.4210 7.4946 6.3386 1.0809 1.0694 1.0682 1.0376 1.0621 1.0608 1.0597 1.0996 1.0906 1.0898 1.1018 1.1004 1.0980 1.0892 1.0878 1.0927 1.1022 1.0907 1.0922 1.1008 1.0964
irintensity: 0.2098 1.3899 2.4166 1.3153 4.7228 1.8870 2.6570 1.5052 0.3237 0.0379 2.3076 0.1983 3.5200 4.4322 3.1964 0.9541 2.0224 0.1527 1.8583 9.2771 7.1078 3.2667 6.3746 0.9571 13.2599 5.6245 2.3960 8.2383 8.0183 4.3287 0.5668 8.5053 9.4428 9.5470 0.3198 1.7753 17.6323 2.4977 2.5371 8.4602 1.9670 37.6700 50.6631 10.9447 1.0014 40.6086 29.2163 17.6129 1.0434 1.6684 13.6217 6.8488 14.6938 3.2807 0.1593 3.1625 5.6773 0.0436 24.0601 20.8741 64.6291 15.5337 20.0826 0.8962 1.3325 30.7059 31.9819 3.8702 3.0260 2.5030 21.5768 10.9913 3.4456 12.0336 5.1418 4.7882 4.7566 12.8736 7.0141 8.2428 1.4698 17.9847 7.2818 1.4752 13.4936 0.8767 4.9468 1.6050 5.4616 6.2422 2.6478 4.7308 9.8362 8.5852 15.3417 0.0976 7.0960 12.6068 31.6280 117.5546 12.4617 9.8583 4.0223 41.9835 4.6151 26.4191 2.8522 6.3518 69.9621 37.1612 37.2896 23.2953 20.1505 7.0681 43.3847 19.9406 20.0470 13.7055 9.3668 1.7183 20.1638 19.6220 1.7972 16.8472 9.2179 3.3208 0.2969 32.4054 3.4350
temp: 298.150 k
press: 1.00000 atm
elementType: 17 16 8 7 7 6 6 6 6 6 6 6 6 6 6 6 6 6 6 6 6 6 6 6 1 1 1 1 1 1 1 1 1 1 1 1 1 1 1 1 1 1 1 1 1
symmnumber: 1
zpe: 946260.2 jmol-1
zpe.correction: 0.360411 hartree
zpe.thermalcorrener: 0.381809 hartree
zpe.thermalcorrenthalpy: 0.382753 hartree
zpe.thermalcorrgfe: 0.309446 hartree
zpe.sumelectzpe: -1777.614797 hartree
zpe.sumelectthermal: -1777.593400 hartree
zpe.sumelectthermalent: -1777.592456 hartree
zpe.sumelectthermalfe: -1777.665763 hartree
dipole: 2.5208 -3.2278 1.7825
dipole: 4.4666
quadrupole: -149.2737 -174.6591 -145.9691
quadrupole: -4.0293 0.8795 9.8561
quadrupole: 7.3602 -18.0251 10.6648 -4.0293 0.8795 9.8561
hfenergy: -1777.9752089 hartree
pointgroup: C01 [X(C19H21Cl1N2O1S1)]
dipole: -0.632168 -1.3972203 0.8580335 debye
polarizability: 195.1458627|-15.2332187|346.2960854|-18.8411034|-14.4940547|211.5869591 unknown
InChI: InChI=1S/C19H21ClN2OS/c1-22(23)10-8-21(9-11-22)17-12-14-4-2-3-5-18(14)24-19-7-6-15(20)13-16(17)19/h2-7,13,17H,8-12H2,1H3
charge 0 multiplicity 1
45 atoms
Cl -1.691444 5.620989 -1.110417
S  -1.575087 -0.155603 1.759878
O  4.506677 0.1431 -0.777773
N  1.049316 0.010318 -0.367949
N  3.853779 -0.540476 0.295581
C  -0.082801 0.565711 -1.160649
C  1.857914 -0.960662 -1.154709
C  1.937411 1.067474 0.191461
C  2.911146 -1.621616 -0.26532
C  2.992273 0.446678 1.106953
C  -1.06242 -0.555305 -1.648346
C  -0.856668 1.644832 -0.407486
C  4.895246 -1.177144 1.195209
C  -1.301903 -1.735006 -0.713837
C  -1.590197 1.395514 0.783017
C  -0.911951 2.943766 -0.97248
C  -1.551529 -1.650118 0.681739
C  -1.31122 -3.033539 -1.297034
C  -2.337247 2.436258 1.39168
C  -1.654058 3.96338 -0.351852
C  -1.79329 -2.824195 1.444679
C  -2.371111 3.732139 0.835878
C  -1.553089 -4.203206 -0.549464
C  -1.793799 -4.095174 0.838902
H  0.307369 1.057228 -2.090359
H  2.384857 -0.468396 -2.005634
H  1.202624 -1.757754 -1.542831
H  1.331983 1.771078 0.787817
H  2.468944 1.634013 -0.608373
H  2.432105 -2.160877 0.573289
H  3.54951 -2.297881 -0.855821
H  3.687667 1.218111 1.474146
H  2.516624 -0.090569 1.948784
H  -0.687875 -0.958089 -2.606892
H  -2.024206 -0.061444 -1.888064
H  4.430572 -1.715162 2.042773
H  5.485458 -1.862577 0.569351
H  5.548208 -0.367402 1.552749
H  -0.358948 3.1507 -1.894396
H  -1.124871 -3.114994 -2.375613
H  -2.910229 2.227905 2.301258
H  -1.990848 -2.736524 2.519565
H  -2.953088 4.528579 1.307712
H  -1.554455 -5.181684 -1.040986
H  -1.986253 -4.986384 1.445759
