program: Gaussian 09
title: 000208689
version: EM64L-G09RevD.01
frameworkgroup: C1[X(C20H18N4O3)]
method: RPBEPBE
basis: SDD
operation: Freq
keyword: #p
keyword: freq=noraman
keyword: PBEPBE/SDD
title: #p freq=noraman PBEPBE/SDD
converged: YES YES NO NO
title: Mulliken charges:
elementType: O O O N N N N C C C C C C C C C C C C C C C C C C C C H H H H H H H H H H H H H H H H H H
charge: -0.494964 -0.299381 -0.290974 -0.404910 -0.385437 -0.001940 -0.001645 0.085491 0.317152 -0.437681 -0.486528 -0.528798 0.246096 0.175676 0.162194 -0.349677 -0.391478 0.452283 0.479084 -0.347662 -0.296800 -0.467489 -0.498930 -0.178423 -0.192324 -0.340379 -0.330280 0.257057 0.273560 0.227773 0.267503 0.227142 0.285119 0.373633 0.315076 0.225077 0.243354 0.269363 0.263308 0.246098 0.232093 0.231589 0.383044 0.243767 0.243166
chargesum: 0.00000
title: Mulliken charges with hydrogens summed into heavy atoms:
elementType: O O O N N N N C C C C C C C C C C C C C C C C C C C C
charge: -0.111919 -0.299381 -0.290974 -0.031277 -0.070361 -0.001940 -0.001645 0.085491 0.317152 -0.180624 0.014805 -0.034153 0.246096 0.175676 0.162194 -0.064557 -0.166401 0.452283 0.479084 -0.104308 -0.027437 -0.204181 -0.252832 0.053670 0.039265 -0.096612 -0.087113
polarizability: 3.65981525e+02 -1.28002657e+01 2.33581676e+02 6.63719978e+00 2.42486617e-01 1.80979520e+02
1716.lowfreq: -13.2329 -7.3175 -2.9789 0.0005 0.0012 0.0013 2.3022 8.5088 19.9359
frequency: -9.9760 3.6150 19.8904 23.2135 27.1338 33.6079 37.5976 58.7204 85.1533 106.6650 135.6856 158.6090 175.8027 202.6447 215.3742 237.7132 244.9020 263.4730 298.4570 318.0867 329.4842 362.3772 364.4324 377.0806 393.1251 397.1124 416.1866 431.2373 446.4876 485.2630 505.7975 523.0850 547.3141 563.4869 591.7874 609.0205 619.7615 626.7340 634.8273 668.2846 672.1942 722.2831 725.1785 740.9171 746.3469 762.5252 766.8243 774.6541 798.8647 804.9958 824.4235 829.3421 830.8590 881.8385 924.6171 929.1327 936.6062 945.8399 946.3986 974.1964 987.0772 987.6527 993.8472 1001.4416 1005.3254 1012.9417 1026.2749 1027.7295 1034.5619 1058.6678 1078.8153 1115.9371 1116.1469 1129.1050 1158.5660 1160.2152 1192.3969 1193.5979 1222.6487 1226.2043 1230.8113 1236.6845 1241.4278 1264.8542 1282.8346 1296.8794 1304.1942 1312.2819 1326.6518 1338.2277 1354.5655 1359.3410 1398.1142 1400.2387 1417.5055 1417.5661 1451.8715 1456.9282 1461.9544 1471.8042 1476.6049 1510.0565 1526.9854 1559.5843 1559.7453 1572.8134 1577.5400 1587.9479 1588.4362 1613.4705 1625.8793 2968.3073 3000.0159 3030.0742 3061.6141 3108.6595 3118.8159 3123.3031 3129.7743 3130.3629 3131.3766 3134.7651 3141.5769 3165.1281 3165.5842 3167.7218 3451.9838 3565.3232 3594.8321
redmass: 5.5261 5.8807 5.7243 4.6697 7.4800 6.3808 5.6385 8.0650 4.7910 6.1491 4.8350 5.0723 4.3273 4.0485 5.3638 5.2364 5.8025 3.5710 4.0660 5.3814 3.8739 7.0273 1.1960 3.0815 2.8268 3.5015 3.6252 3.2393 4.5710 4.3996 4.7040 3.2305 4.2726 1.5090 5.2066 5.7803 6.8844 6.2887 5.3247 5.9603 6.8413 1.9286 1.9505 4.5334 1.1827 4.4559 3.8779 4.9433 2.7049 1.8780 3.9451 2.1329 1.6392 3.7589 1.3819 1.3413 1.4382 1.4483 1.5235 2.7860 1.4312 1.3488 1.4370 2.6485 3.5470 3.2702 3.0344 3.2024 3.2975 3.2889 2.7560 1.6325 1.6304 1.8785 2.5290 1.1754 1.4710 1.4475 1.9410 2.2119 1.9287 1.3573 1.3403 2.2008 2.1647 1.5547 4.2639 6.1759 1.5280 1.2426 1.3557 1.3053 4.4474 7.7049 2.0341 2.0311 1.3102 2.0752 1.7935 2.0763 1.1175 2.2188 2.0227 5.2907 5.3810 7.0344 5.6319 5.6353 5.6735 6.6021 5.9558 1.0637 1.0602 1.0962 1.1019 1.0910 1.0902 1.0887 1.0906 1.0880 1.0905 1.0919 1.0924 1.0997 1.1002 1.0946 1.0805 1.0775 1.0663
irintensity: 0.2744 1.1163 2.5482 1.1224 6.5306 9.0079 0.6070 1.6646 6.2829 2.4905 0.2009 0.7379 2.6109 0.3810 4.1929 19.7893 1.3459 6.3972 3.0375 8.4975 15.1410 0.3407 114.9794 9.4728 2.6384 2.4925 8.0969 1.7764 0.9554 17.0757 42.5371 1.1749 6.3804 102.2063 0.7478 20.5195 2.5802 11.7270 5.5903 20.0504 11.9927 47.2996 38.5077 9.6731 107.6290 16.2800 9.5736 5.2936 25.1360 30.2428 11.5044 25.0520 29.2898 2.3950 2.2088 1.0585 1.8013 2.0294 16.3753 2.4733 0.4862 0.7149 2.0420 1.0886 5.5566 27.0131 3.1624 0.4672 1.1247 48.1368 112.6901 15.5766 35.6231 60.4769 17.3868 3.1908 5.2609 0.9865 13.2240 42.5038 6.0597 79.8025 6.1031 251.2572 76.7366 69.7366 13.7666 10.6769 6.8246 20.7327 5.7183 14.8662 18.7019 2.7155 35.2071 50.5356 45.4361 41.0657 1.6725 257.8799 12.9812 134.1912 390.6465 5.8982 5.5108 90.1978 16.3781 1.5464 4.3561 123.8923 147.5461 48.0745 38.7082 21.1315 8.2686 25.6408 15.2659 5.6533 13.4049 5.0166 30.2826 10.8421 14.7792 30.9268 21.1692 4.0607 99.4171 14.5154 70.8199
temp: 298.150 k
press: 1.00000 atm
elementType: 8 8 8 7 7 7 7 6 6 6 6 6 6 6 6 6 6 6 6 6 6 6 6 6 6 6 6 1 1 1 1 1 1 1 1 1 1 1 1 1 1 1 1 1 1
symmnumber: 1
zpe: 910474.4 jmol-1
zpe.correction: 0.346781 hartree
zpe.thermalcorrener: 0.369606 hartree
zpe.thermalcorrenthalpy: 0.370550 hartree
zpe.thermalcorrgfe: 0.288741 hartree
zpe.sumelectzpe: -1215.726193 hartree
zpe.sumelectthermal: -1215.703369 hartree
zpe.sumelectthermalent: -1215.702425 hartree
zpe.sumelectthermalfe: -1215.784234 hartree
dipole: -4.4033 2.7871 -4.5636
dipole: 6.9270
quadrupole: -159.5122 -156.8810 -152.4523
quadrupole: 5.0336 13.5455 -6.7729
quadrupole: -3.2304 -0.5992 3.8296 5.0336 13.5455 -6.7729
hfenergy: -1216.0729747 hartree
pointgroup: C01 [X(C20H18N4O3)]
dipole: 2.2336965 1.4128812 0.6644815 debye
polarizability: 353.5793929|-12.7535975|224.5538885|-47.0035917|-16.0620339|202.4094398 unknown
InChI: InChI=1S/C20H18N4O3/c25-18-6-5-16(19(26)23-12-14-3-1-7-21-10-14)9-17(18)20(27)24-13-15-4-2-8-22-11-15/h1-11,23-25H,12-13H2
charge 0 multiplicity 1
45 atoms
O  2.732233 2.015489 -0.763336
O  1.00131 -1.802947 0.068034
O  -3.709327 2.38551 -1.001303
N  2.977597 -0.597292 -0.172195
N  -3.533058 0.161361 -0.355327
N  5.705744 -1.858836 -3.258552
N  -6.908481 -1.372154 2.697601
C  0.80707 0.554891 -0.453798
C  -1.476244 1.487273 -0.693215
C  -0.601181 0.409477 -0.436716
C  3.834423 -1.758705 0.098179
C  -4.990946 -0.056167 -0.360401
C  1.332893 1.844782 -0.743212
C  1.601438 -0.70102 -0.165346
C  -2.98014 1.385044 -0.695012
C  -0.918458 2.759962 -0.982236
C  0.473455 2.938215 -1.006221
C  4.959804 -1.912968 -0.915418
C  -5.598897 -0.120362 1.034816
C  6.259401 -2.304014 -0.510829
C  -5.47331 0.963879 1.94111
C  4.743216 -1.702391 -2.303074
C  -6.325689 -1.25692 1.466534
C  7.268935 -2.475984 -1.483697
C  -6.068105 0.865655 3.216231
C  6.949169 -2.24375 -2.840693
C  -6.772539 -0.315919 3.551558
H  -0.943424 -0.609799 -0.220671
H  3.166237 -2.641173 0.090134
H  4.263171 -1.691467 1.118882
H  -5.419395 0.793558 -0.922522
H  -5.21762 -0.98641 -0.914418
H  -1.604279 3.587749 -1.187538
H  3.396108 0.321684 -0.359204
H  -2.935563 -0.605316 -0.045123
H  0.896979 3.925798 -1.230593
H  6.477609 -2.471662 0.551014
H  -4.926124 1.864531 1.640524
H  3.755873 -1.393821 -2.66602
H  -6.45207 -2.120762 0.800453
H  8.281973 -2.7787 -1.200355
H  -5.99501 1.684349 3.939165
H  2.984804 2.939062 -1.007543
H  7.701949 -2.365492 -3.627831
H  -7.246727 -0.430438 4.533069
