program: Gaussian 09
title: 000208673
version: EM64L-G09RevD.01
frameworkgroup: C1[X(C13H18ClNO)]
method: RPBEPBE
basis: SDD
operation: Freq
keyword: #p
keyword: freq=noraman
keyword: PBEPBE/SDD
title: #p freq=noraman PBEPBE/SDD
converged: YES YES NO NO
title: Mulliken charges:
elementType: Cl O N C C C C C C C C C C C C C H H H H H H H H H H H H H H H H H H
charge: -0.082146 -0.261014 -0.618520 -0.195172 -0.557011 0.578102 0.535996 -0.378582 -0.338820 -0.382739 -0.446121 -0.429287 -0.499874 -0.715369 -0.681277 0.228330 0.227995 0.204835 0.205346 0.256040 0.221234 0.233628 0.258130 0.236830 0.233807 0.206879 0.202145 0.220210 0.226925 0.236135 0.212607 0.213217 0.312869 0.334671
chargesum: 0.00000
title: Mulliken charges with hydrogens summed into heavy atoms:
elementType: Cl O N C C C C C C C C C C C C C
charge: -0.082146 -0.261014 0.029020 0.032823 -0.146830 0.578102 0.535996 0.098693 -0.338820 -0.149112 -0.187991 -0.192457 -0.059188 -0.066088 -0.019319 0.228330
polarizability: 2.13108961e+02 -6.39002983e+00 1.58479455e+02 1.34489061e+01 3.31370190e+00 1.10343420e+02
1716.lowfreq: -7.3522 -6.0422 -3.4794 -0.0020 0.0011 0.0016 5.9243 26.0445 32.8655
frequency: 5.5330 26.0325 32.8012 44.5775 69.4146 83.0424 107.5113 160.5887 164.9093 191.1157 206.7632 211.2701 231.3712 252.9068 291.6571 318.2051 371.2952 388.4729 405.0132 430.0237 461.8197 475.8497 500.2804 522.3157 541.7066 591.5057 623.6916 672.8593 678.4510 698.5600 740.7491 747.3748 829.8258 835.4304 849.9356 875.6901 887.1454 895.3553 921.6204 958.9943 960.4885 1014.4791 1024.2330 1040.5417 1058.4466 1060.6999 1070.1923 1111.7672 1128.1794 1138.6381 1167.3873 1208.1284 1230.4113 1238.0309 1253.7728 1273.1812 1281.4400 1296.9087 1300.2672 1327.2468 1339.0685 1366.8945 1376.7304 1378.4054 1391.8438 1399.3863 1446.1282 1466.5144 1467.5650 1469.6868 1481.0852 1486.1049 1487.8566 1491.7147 1560.6978 1594.7479 1617.1962 1643.1729 2970.6119 2972.1328 2975.5651 2978.1706 2998.7596 2999.2567 3021.5240 3028.1174 3067.4103 3070.5846 3074.9257 3080.9352 3086.2111 3124.0867 3148.2894 3154.8446 3515.9254 3673.4283
redmass: 5.5079 4.8275 5.0852 2.9099 3.0617 3.1475 2.3358 3.5173 4.8666 4.0232 3.2534 2.2032 1.5731 1.0625 4.0181 2.7891 4.5078 3.6084 3.0391 2.9013 3.8481 2.6809 1.4869 2.0179 2.7968 2.0073 2.5606 5.0685 2.4597 3.8207 3.3586 1.1785 2.7260 1.4773 1.7348 2.4042 1.8261 2.6029 1.2019 1.4109 1.3853 2.7065 2.8177 2.5755 2.6173 1.7880 1.6561 2.3865 1.5004 1.5066 1.4629 1.5555 2.7836 1.3747 1.3485 1.5241 1.2921 1.3042 1.4546 1.6355 1.5648 2.4215 1.9223 1.6295 1.8444 1.5737 1.0998 1.0905 1.0535 1.0883 1.3630 1.0956 1.0905 1.6161 6.4526 1.4207 7.2002 3.6580 1.0599 1.0591 1.0351 1.0364 1.0828 1.0623 1.0979 1.1014 1.0995 1.1037 1.0993 1.1002 1.0998 1.0883 1.0921 1.0947 1.0447 1.1042
irintensity: 1.7375 12.5850 2.3116 0.3825 2.6808 0.8270 0.9742 2.3302 0.7075 2.0976 1.4404 0.4158 0.4844 0.2429 5.2003 0.8264 5.4800 1.1502 3.3042 1.6969 4.9871 6.6869 75.9106 106.9271 16.9770 69.4013 12.1211 4.2707 55.3050 1.9282 2.0797 11.3833 20.8256 22.1748 3.0033 7.5731 13.8910 8.1913 4.8359 0.5741 0.3486 11.8359 22.9424 2.1355 3.9937 4.9982 15.6073 6.7185 3.7633 5.5242 0.5792 3.2818 10.6430 1.7843 17.5681 36.8233 22.8551 0.0384 23.3982 8.9499 25.2937 130.8807 8.2366 15.7791 7.0890 20.1401 11.6404 7.6738 4.2528 0.3428 4.6186 22.8258 4.1932 52.0626 17.6099 70.3395 10.8884 274.3726 19.3193 34.0716 28.9277 31.8094 3.8358 33.8327 22.2908 3.0864 6.1896 36.8933 77.7294 36.2060 31.2687 11.1987 8.2236 10.4878 29.9949 21.4320
temp: 298.150 k
press: 1.00000 atm
elementType: 17 8 7 6 6 6 6 6 6 6 6 6 6 6 6 6 1 1 1 1 1 1 1 1 1 1 1 1 1 1 1 1 1 1
symmnumber: 1
zpe: 741036.8 jmol-1
zpe.correction: 0.282246 hartree
zpe.thermalcorrener: 0.299870 hartree
zpe.thermalcorrenthalpy: 0.300814 hartree
zpe.thermalcorrgfe: 0.232681 hartree
zpe.sumelectzpe: -1095.030672 hartree
zpe.sumelectthermal: -1095.013048 hartree
zpe.sumelectthermalent: -1095.012104 hartree
zpe.sumelectthermalfe: -1095.080238 hartree
dipole: -2.3591 1.8974 -1.3719
dipole: 3.3238
quadrupole: -82.6542 -105.4459 -105.8641
quadrupole: -26.1692 4.1646 3.5166
quadrupole: 15.3338 -7.4578 -7.8760 -26.1692 4.1646 3.5166
hfenergy: -1095.3129183 hartree
pointgroup: C01 [X(C13H18Cl1N1O1)]
dipole: -1.0014183 0.6710682 -0.5068007 debye
polarizability: 213.4723915|-0.9808737|156.8088866|14.3466544|8.1638406|111.6505584 unknown
InChI: InChI=1S/C13H18ClNO/c1-9(2)11-7-6-10(8-12(11)14)4-3-5-13(15)16/h6-9H,3-5,15H2,1-2H3
charge 0 multiplicity 1
34 atoms
Cl 2.852287 2.721399 0.524694
O  -4.618002 -2.031522 0.706762
N  -6.099893 -0.249766 0.673676
C  4.146622 -0.160674 0.258899
C  -1.564787 0.397629 -1.313418
C  2.688722 -0.0100 -0.182955
C  -0.094897 0.262663 -0.943451
C  -2.507086 -0.202007 -0.235411
C  1.988686 1.217089 -0.093688
C  1.929901 -1.108561 -0.671875
C  0.638688 1.37347 -0.460387
C  0.575774 -0.982769 -1.042041
C  -3.996849 -0.05016 -0.616279
C  4.91572 -1.260133 -0.510239
C  4.214271 -0.414345 1.792535
C  -4.910362 -0.864921 0.310731
H  4.651112 0.805739 0.063671
H  -1.816223 1.465132 -1.468852
H  -1.759692 -0.119094 -2.275095
H  -2.292124 -1.276778 -0.094105
H  -2.315329 0.287453 0.738808
H  2.421189 -2.082193 -0.769206
H  0.161533 2.355128 -0.373406
H  0.034006 -1.859559 -1.416776
H  -4.146938 -0.438843 -1.644649
H  -4.292043 1.017296 -0.630061
H  4.544899 -2.27242 -0.262369
H  5.985518 -1.229331 -0.234529
H  4.838437 -1.122225 -1.603893
H  3.719343 0.396789 2.354572
H  5.266807 -0.472863 2.126771
H  3.716195 -1.367355 2.051219
H  -6.336473 0.693803 0.37321
H  -6.754012 -0.764472 1.263636
