program: Gaussian 09
title: 000208711
version: EM64L-G09RevD.01
frameworkgroup: C1[X(C19H20BrN5O5)]
method: RPBEPBE
basis: SDD
operation: Freq
keyword: #p
keyword: freq=noraman
keyword: PBEPBE/SDD
title: #p freq=noraman PBEPBE/SDD
converged: YES YES NO NO
title: Mulliken charges:
elementType: Br O O O O O N N N N N C C C C C C C C C C C C C C C C C C C H H H H H H H H H H H H H H H H H H H H
charge: -0.025253 -0.298394 -0.204548 -0.210860 -0.180101 -0.254791 -0.114833 0.017706 -0.161197 -0.448783 0.019194 -0.426635 -0.381571 0.317973 0.275439 -0.511327 0.138766 -0.567706 0.332451 0.134128 0.472500 -0.394272 -0.397021 0.464764 -0.348633 -0.339045 -0.372313 -0.493963 -0.670507 -0.658728 0.255489 0.259720 0.255890 0.269478 0.304343 0.329747 0.350936 0.254575 0.256520 0.225428 0.228245 0.233152 0.234238 0.309762 0.246000 0.307999 0.282271 0.220653 0.241637 0.221474
chargesum: 0.00000
title: Mulliken charges with hydrogens summed into heavy atoms:
elementType: Br O O O O O N N N N N C C C C C C C C C C C C C C C C C C C
charge: -0.025253 -0.298394 -0.204548 -0.210860 -0.180101 -0.254791 -0.114833 0.017706 -0.161197 -0.097847 0.019194 0.088574 0.143797 0.317973 0.275439 -0.206983 0.138766 -0.237959 0.332451 0.134128 0.472500 0.116823 0.056653 0.464764 -0.115481 -0.104807 -0.062551 -0.247963 -0.080237 0.025036
polarizability: 9.33861542e+02 -6.91243261e+01 3.63633822e+02 2.66999218e+01 3.03629100e+01 1.50561608e+02
1716.lowfreq: -1.8394 -0.7441 0.0000 0.0004 0.0007 4.3968 12.0375 14.2347 19.5261
frequency: 11.9250 14.2128 19.5224 32.9097 36.3179 43.9168 47.8295 54.7389 72.0775 91.6631 92.4934 102.8788 118.3404 124.6867 135.3447 149.2779 166.0454 173.4152 178.2814 190.4787 205.6301 222.5031 229.7173 249.6132 277.3670 294.5897 315.0101 330.6285 340.3932 351.8097 372.6389 399.7309 401.6587 414.3736 425.1742 430.1699 456.8365 506.5438 510.7537 528.5111 544.6199 576.0465 581.4769 622.3997 630.9246 640.6840 659.4432 678.5471 688.5800 700.9463 720.6323 727.3556 728.9271 742.5072 756.6249 768.9841 791.9046 792.5422 803.3084 816.7504 830.1496 859.1299 867.9313 892.3950 910.6593 932.8591 944.5540 949.1416 962.4803 979.0537 981.2387 982.1363 992.4440 1001.9698 1005.3175 1030.3679 1075.7103 1084.4181 1099.6576 1101.6519 1115.0678 1124.4616 1126.7621 1134.8528 1139.7612 1155.4137 1170.0351 1172.4543 1197.0088 1207.5875 1211.2450 1211.7985 1225.6250 1258.3300 1270.6442 1284.6991 1291.9803 1305.3139 1326.6053 1343.7978 1348.3930 1349.6387 1365.4352 1371.2419 1385.3235 1388.8485 1395.8361 1443.5951 1451.5021 1453.4184 1458.9998 1467.9120 1474.6873 1479.2919 1489.4194 1491.7023 1506.1260 1519.5526 1535.2628 1546.6521 1569.3444 1606.4835 1624.4630 1634.6281 2986.8088 2997.3993 3015.5608 3046.3330 3061.8780 3072.4854 3072.5158 3083.1610 3092.9518 3095.8234 3128.0193 3148.1974 3149.7968 3152.3864 3153.7083 3170.1454 3181.3557 3182.8146 3194.7978 3207.2191
redmass: 8.7514 7.4199 13.8225 7.3353 9.8834 8.2893 4.7158 5.9313 5.2567 4.9328 3.6836 3.7907 4.5908 3.4672 3.4679 3.9447 5.0194 4.8267 6.6134 6.2753 2.0134 3.8354 1.9422 4.7992 4.5220 6.6376 6.9436 6.6435 10.5394 5.3707 5.2673 6.3792 3.9111 4.2586 3.7675 5.8893 4.1101 3.4893 3.6181 3.4733 5.0512 7.8667 5.7612 4.9517 6.9032 7.8399 7.5551 5.8855 9.0975 5.5382 6.4595 4.1052 5.6095 5.5230 12.3366 1.1365 1.0625 1.1615 1.3252 5.4055 1.5779 6.2396 5.2934 2.3075 1.1792 2.1077 2.9061 1.3375 1.5035 1.7809 1.3080 2.8846 3.1917 1.5589 1.3936 4.4762 2.0201 4.9203 1.3644 1.5975 2.2582 1.3528 1.4682 1.4424 1.4975 2.9913 2.3108 4.7930 3.1308 2.3064 1.8693 2.7951 1.1651 1.2810 1.3986 2.2735 1.1929 7.4560 1.4476 1.2670 7.5654 1.4085 9.5534 4.4867 3.8741 1.2565 2.0357 3.3561 2.3369 1.1613 1.1432 1.0439 1.7022 1.0671 1.0911 4.1863 1.2246 2.3018 3.6923 9.1020 9.6679 3.6039 2.9150 3.4658 1.0357 1.0606 1.0604 1.1025 1.0570 1.0994 1.0566 1.0998 1.0577 1.1009 1.0900 1.1108 1.0888 1.0877 1.0887 1.0933 1.1176 1.0907 1.0946 1.1172
irintensity: 2.1094 0.6719 0.6962 1.5656 0.7897 1.2660 0.4627 1.2726 0.1095 2.6686 4.1823 4.1252 5.1598 3.7438 1.3251 3.4566 17.5797 0.2898 3.1377 7.9447 8.7481 13.6068 2.3024 7.6951 2.4484 0.2054 7.2739 4.4756 0.4491 3.7861 0.4584 3.7536 4.1060 10.7274 7.1800 1.8972 3.4436 24.5167 18.0184 13.5228 24.4736 3.9675 30.3537 112.4680 2.3555 8.3922 16.0577 31.2745 7.5661 1.4854 9.0954 4.9197 14.8430 4.2018 6.1777 9.3006 39.6489 26.0178 6.2049 0.9373 56.7670 16.5222 12.6707 2.3413 77.7162 4.6594 6.9331 23.3223 38.2220 1.5537 6.5567 100.6770 13.8685 42.7846 16.6716 2.4928 48.3035 18.2007 13.4145 33.5578 7.9633 22.0546 42.2641 3.0328 5.6669 3.8791 41.4067 494.1074 666.6445 170.6469 88.5171 429.0334 22.7459 17.8112 107.8071 81.4866 12.3335 174.7030 16.6384 12.1259 12.8198 250.7880 56.4907 18.1554 90.0706 21.6886 232.1780 0.2129 4.4618 21.8685 3.3622 9.5852 19.0395 2.8320 33.1675 279.7629 34.1575 238.4268 49.6574 177.5743 180.7589 1141.5646 122.7325 444.4977 37.3251 65.2289 58.5961 7.6017 13.3475 3.2061 23.4701 46.2097 40.5739 51.5195 2.4578 11.6932 15.0012 127.9087 5.6526 32.3924 4.5929 22.9947 7.8420 10.7535
temp: 298.150 k
press: 1.00000 atm
elementType: 35 8 8 8 8 8 7 7 7 7 7 6 6 6 6 6 6 6 6 6 6 6 6 6 6 6 6 6 6 6 1 1 1 1 1 1 1 1 1 1 1 1 1 1 1 1 1 1 1 1
symmnumber: 1
zpe: 983336.6 jmol-1
zpe.correction: 0.374533 hartree
zpe.thermalcorrener: 0.403305 hartree
zpe.thermalcorrenthalpy: 0.404249 hartree
zpe.thermalcorrgfe: 0.309482 hartree
zpe.sumelectzpe: -1396.967602 hartree
zpe.sumelectthermal: -1396.938830 hartree
zpe.sumelectthermalent: -1396.937885 hartree
zpe.sumelectthermalfe: -1397.032652 hartree
dipole: 4.6996 2.1129 1.4347
dipole: 5.3487
quadrupole: -205.5001 -177.1335 -187.3108
quadrupole: -55.4481 -0.0163 -3.9119
quadrupole: -15.5186 12.8479 2.6707 -55.4481 -0.0163 -3.9119
hfenergy: -1397.3421346 hartree
pointgroup: C01 [X(C19H20Br1N5O5)]
dipole: -1.7537673 -0.7331842 -0.9027842 debye
polarizability: 942.7608891|-3.3006944|175.7349793|2.8191811|75.804291|329.561104 unknown
InChI: InChI=1S/C19H20BrN5O5/c1-2-22(8-7-20)14-5-3-13(4-6-14)21-19(26)15-11-17(23-9-10-23)18(25(29)30)12-16(15)24(27)28/h3-6,11-12,21H,2,7-10H2,1H3
charge 0 multiplicity 1
50 atoms
Br -8.014528 -0.318323 -3.57641
O  0.226343 -0.847746 -1.479078
O  6.723545 0.320039 1.654363
O  7.060489 -0.996965 -0.174759
O  2.66167 1.84555 3.031255
O  0.784481 0.600713 2.800039
N  4.891372 -1.711965 -1.724295
N  6.286105 -0.343103 0.633055
N  -6.175841 -0.452631 0.297155
N  -0.491692 -0.315418 0.681126
N  1.98757 0.939484 2.410071
C  4.584824 -1.901625 -3.154822
C  5.975863 -1.439636 -2.673348
C  4.225796 -1.026018 -0.739856
C  4.834574 -0.371181 0.390618
C  2.800864 -1.008907 -0.786664
C  1.951823 -0.417907 0.16697
C  4.026687 0.259556 1.346898
C  2.618454 0.241406 1.275907
C  0.479901 -0.526792 -0.267576
C  -4.771076 -0.431372 0.368545
C  -6.874272 -0.889536 -0.922389
C  -7.016864 -0.112023 1.465906
C  -1.896133 -0.370268 0.5130
C  -3.955197 -0.712275 -0.773146
C  -4.094224 -0.117925 1.591294
C  -2.552664 -0.686691 -0.708681
C  -2.695042 -0.086599 1.655817
C  -7.058168 0.296611 -1.889845
C  -7.233755 -1.296859 2.436312
H  4.452621 -2.937189 -3.484785
H  3.930354 -1.165066 -3.638396
H  6.255512 -0.393142 -2.839074
H  6.810269 -2.145537 -2.659799
H  2.298539 -1.460169 -1.648495
H  4.514661 0.767445 2.18277
H  -0.141363 -0.063192 1.628946
H  -7.864184 -1.294737 -0.647555
H  -6.326563 -1.708058 -1.4215
H  -7.996127 0.233976 1.086198
H  -6.57403 0.749051 1.999486
H  -4.411799 -0.949169 -1.738822
H  -4.658317 0.096428 2.502395
H  -1.95126 -0.902391 -1.593279
H  -2.20918 0.160585 2.607577
H  -6.100668 0.715913 -2.231708
H  -7.695601 1.08777 -1.46675
H  -7.871963 -0.988092 3.284667
H  -6.274495 -1.66466 2.839346
H  -7.730613 -2.139457 1.922613
