program: Gaussian 09
title: 000208643
version: EM64L-G09RevD.01
frameworkgroup: C1[X(C15H11N3O)]
method: RPBEPBE
basis: SDD
operation: Freq
keyword: #p
keyword: freq=noraman
keyword: PBEPBE/SDD
title: #p freq=noraman PBEPBE/SDD
converged: NO YES NO YES
title: Mulliken charges:
elementType: O N N N C C C C C C C C C C C C C C C H H H H H H H H H H H
charge: -0.232299 -0.332133 -0.399066 -0.066357 0.061410 0.346246 0.075167 0.408986 0.093683 0.028004 -0.624619 -0.316890 0.505046 -0.352713 -0.385493 -0.346485 -0.220845 -0.227499 -0.807199 0.343570 0.239849 0.272060 0.290508 0.239229 0.250630 0.226493 0.226777 0.238426 0.227046 0.238467
chargesum: 0.00000
title: Mulliken charges with hydrogens summed into heavy atoms:
elementType: O N N N C C C C C C C C C C C C C C C
charge: -0.232299 -0.332133 -0.055496 -0.066357 0.061410 0.346246 0.075167 0.408986 0.093683 0.028004 -0.384771 -0.044830 0.505046 -0.062205 -0.146264 -0.095854 0.005648 -0.000722 -0.103259
polarizability: 3.53415177e+02 -1.55386841e+00 1.84325385e+02 7.43859465e-04 5.99174730e-04 7.43876077e+01
1716.lowfreq: -8.0268 -1.6218 -0.0008 -0.0004 0.0003 9.6831 46.3641 69.2698 93.0080
frequency: 46.3609 69.2117 93.0075 121.6850 142.2034 147.0169 229.5819 241.4024 259.7361 302.0341 318.0443 349.2338 356.8734 402.6443 441.7766 449.0002 474.0908 529.4833 550.7818 569.0973 582.7342 601.3464 612.4012 627.8302 674.8582 682.8617 691.5097 717.3914 762.2482 770.7094 773.2800 775.0976 822.9461 839.6366 874.6902 875.2309 876.7607 949.0019 951.2419 984.0375 991.0580 997.3758 1009.0475 1031.0873 1047.2337 1083.7728 1124.2163 1139.4966 1159.4793 1181.7424 1209.5277 1239.6004 1253.2381 1277.1847 1289.0399 1317.0121 1334.4912 1393.8321 1397.8664 1402.0556 1410.3806 1437.6487 1464.0815 1466.6211 1468.0756 1485.8258 1498.1096 1569.3258 1576.8989 1605.4834 1611.4432 1637.0801 1648.6189 2981.1433 3060.5702 3090.9349 3123.1854 3134.3902 3137.4912 3153.7100 3164.1333 3171.4548 3193.0123 3567.2674
redmass: 4.4976 1.1047 3.9097 5.6675 4.8586 5.1475 4.7023 4.5440 5.1710 5.5235 6.9194 4.3786 4.9103 5.2206 3.1176 3.1419 5.7676 7.9559 9.0064 2.8578 3.0773 5.6176 1.5277 7.2227 5.1839 6.4965 5.2066 6.0787 1.6616 3.6806 2.7041 6.0856 6.8281 1.4036 1.4338 6.8270 1.5135 2.8322 1.3739 1.2984 1.3395 2.5501 1.7263 2.8551 1.5771 3.0486 2.2829 1.6338 1.1754 1.8463 2.0582 3.6544 1.9630 3.7594 1.4953 4.5704 2.4707 4.2243 1.7277 2.9452 2.2793 3.1585 2.2575 2.1967 1.0453 1.7270 3.1237 7.6088 6.5888 9.2888 7.7128 6.7853 7.5182 1.0374 1.0973 1.0992 1.0916 1.0863 1.0887 1.0920 1.0964 1.0973 1.0965 1.0776
irintensity: 1.8563 0.1606 0.4141 2.0556 1.2879 0.3961 4.9973 2.2785 2.7638 1.3577 6.1409 2.7603 2.0708 2.7328 0.1902 14.4203 12.7229 1.1389 3.1960 13.2898 2.5230 0.7387 95.0896 0.1134 0.1086 1.8421 5.5436 17.8492 54.8265 2.3276 61.4408 0.1676 8.0536 42.9406 0.9380 22.9668 8.8012 8.0388 5.9727 0.1417 1.3797 1.2505 28.5671 1.2970 15.3436 12.6889 16.2850 48.5104 5.0824 18.8192 15.1901 12.4676 30.4523 28.1343 32.0529 98.0087 2.7789 0.2425 10.8231 2.5964 65.1298 34.6276 8.1070 5.2077 14.4364 59.0695 60.4222 140.0635 249.3699 141.6470 142.1872 281.7059 331.7081 28.2198 15.0942 17.3976 13.2875 5.3964 6.9328 21.8308 7.8555 20.2951 4.7591 73.4902
temp: 298.150 k
press: 1.00000 atm
elementType: 8 7 7 7 6 6 6 6 6 6 6 6 6 6 6 6 6 6 6 1 1 1 1 1 1 1 1 1 1 1
symmnumber: 1
zpe: 598577.4 jmol-1
zpe.correction: 0.227986 hartree
zpe.thermalcorrener: 0.242220 hartree
zpe.thermalcorrenthalpy: 0.243164 hartree
zpe.thermalcorrgfe: 0.186864 hartree
zpe.sumelectzpe: -816.437881 hartree
zpe.sumelectthermal: -816.423647 hartree
zpe.sumelectthermalent: -816.422703 hartree
zpe.sumelectthermalfe: -816.479003 hartree
dipole: -4.3783 -1.9972 0.0005
dipole: 4.8123
quadrupole: -83.4588 -109.4517 -114.5872
quadrupole: 6.1291 0.0006 0.0000
quadrupole: 19.0404 -6.9525 -12.0880 6.1291 0.0006 0.0000
hfenergy: -816.6658669 hartree
pointgroup: C01[X(C15H11N3O1)]
dipole: 1.7102736 -0.8119921 -0.0161356 debye
polarizability: 353.4217628|-1.0597683|184.2543649|0.558569|2.6353155|74.4520419 unknown
InChI: InChI=1S/C15H11N3O/c1-9-6-7-10-12(8-9)17-15-16-11-4-2-3-5-13(11)18(15)14(10)19/h2-8,17H,1H3
charge 0 multiplicity 1
30 atoms
O  -0.100457 2.448595 0.058631
N  -0.784052 0.207686 0.003355
N  0.789184 -1.613698 -0.037166
N  -1.616452 -1.953097 -0.050186
C  -0.523909 -1.18939 -0.029655
C  -2.199124 0.332115 0.003357
C  1.593691 0.69212 0.019913
C  1.860877 -0.712944 -0.013328
C  0.213584 1.225468 0.029843
C  -2.68957 -1.017993 -0.030037
C  3.200834 -1.18265 -0.021884
C  2.690163 1.593766 0.043891
C  4.281224 -0.279632 0.001995
C  -3.048518 1.453111 0.02829
C  4.009055 1.123307 0.035244
C  -4.078711 -1.259836 -0.038896
C  -4.437577 1.188542 0.018839
C  -4.942421 -0.141874 -0.014127
C  5.714071 -0.776909 -0.00712
H  0.947118 -2.621851 -0.060946
H  3.393198 -2.262379 -0.047447
H  2.462863 2.664546 0.069295
H  -2.646984 2.468105 0.05354
H  4.844883 1.831482 0.054097
H  -4.46138 -2.284199 -0.064252
H  -5.140447 2.028419 0.037351
H  -6.026416 -0.300738 -0.020345
H  6.258551 -0.429691 0.890787
H  5.767757 -1.878265 -0.032294
H  6.261362 -0.388914 -0.886448
