program: Gaussian 09
title: 000208650
version: EM64L-G09RevD.01
frameworkgroup: C1[X(C16H12N2O3)]
method: RPBEPBE
basis: SDD
operation: Freq
keyword: #p
keyword: freq=noraman
keyword: PBEPBE/SDD
title: #p freq=noraman PBEPBE/SDD
converged: YES YES NO NO
title: Mulliken charges:
elementType: O O O N N C C C C C C C C C C C C C C C C H H H H H H H H H H H H
charge: -0.315713 -0.233285 -0.270004 -0.364098 -0.357672 0.177779 0.227082 0.216484 0.144832 -0.383307 -0.348297 -0.359542 0.144179 -0.241402 -0.203506 0.434294 -0.396709 -0.363703 -0.196044 -0.202538 -0.261019 0.298441 0.283692 0.258570 0.240858 0.240420 0.351431 0.327301 0.232146 0.235798 0.227648 0.225249 0.230635
chargesum: 0.00000
title: Mulliken charges with hydrogens summed into heavy atoms:
elementType: O O O N N C C C C C C C C C C C C C C C C
charge: -0.315713 -0.233285 -0.270004 -0.012666 -0.030371 0.177779 0.227082 0.216484 0.144832 -0.084866 -0.064604 -0.100971 0.144179 -0.000544 0.036914 0.434294 -0.164563 -0.127904 0.031604 0.022711 -0.030385
polarizability: 3.73007041e+02 1.76851000e+01 2.16541125e+02 -1.26470524e+01 1.91998492e+00 9.83656264e+01
1716.lowfreq: -7.4638 -5.4671 -0.0007 -0.0006 -0.0004 2.8269 14.9158 30.8294 38.2555
frequency: 14.8094 30.8187 38.2015 54.4578 81.1671 111.5053 141.0601 175.0498 197.2940 223.6421 244.6721 254.4342 277.5992 281.8580 344.1382 405.0740 425.6148 458.0537 460.1052 495.0172 499.2256 505.1974 512.7585 527.7185 572.9774 592.4084 594.2959 612.1238 627.2391 667.1048 691.7993 710.8842 717.5122 755.0793 759.4027 772.4852 784.4036 823.1621 830.7883 860.5158 883.1699 886.5083 908.8569 922.7636 961.6578 973.6697 981.6197 983.1970 1004.0364 1019.1894 1023.4360 1044.3304 1070.9804 1088.0340 1123.3074 1162.9209 1171.1485 1173.5670 1187.1474 1193.6202 1234.7024 1241.3265 1279.6272 1294.7745 1321.8363 1327.9375 1381.6103 1397.9578 1423.1629 1446.1624 1455.2235 1460.4049 1484.4482 1528.4190 1557.7444 1574.5317 1580.6069 1600.6694 1617.5229 1619.6951 1626.3749 3125.0183 3130.9507 3142.5915 3145.0110 3153.8400 3153.8855 3165.9165 3170.4932 3177.1408 3189.8548 3478.0640 3531.2792
redmass: 6.0789 5.7468 3.9869 8.1865 6.2816 5.4771 6.4605 5.0895 5.2788 6.0761 5.2241 3.9315 7.8970 5.6031 8.8313 2.8915 3.5161 3.4387 2.3473 4.8644 9.1121 4.0120 5.0163 4.9852 2.4914 1.8543 5.1574 5.8670 3.4078 3.4421 1.9924 5.8331 7.8547 1.7123 2.6012 5.4620 1.5355 1.3057 5.0779 4.8409 1.4138 1.4997 1.4870 5.5215 1.3776 1.3687 5.6675 1.3132 1.3348 2.6161 2.1689 3.4194 3.4336 1.5904 1.6319 1.3552 1.8067 1.3998 1.1506 2.2032 1.8885 1.9092 1.9003 2.4661 1.6035 2.9238 4.2071 9.9360 2.1786 2.6682 2.2089 2.6082 2.3108 1.7148 9.7933 7.7770 8.0123 5.2851 6.9588 6.5220 8.1145 1.0861 1.0868 1.0862 1.0923 1.0950 1.0906 1.0953 1.1014 1.1007 1.0925 1.0762 1.0791
irintensity: 2.2610 0.2316 0.4136 2.9135 0.1221 2.0684 2.8618 8.5246 5.9992 1.9249 4.0385 5.9598 4.7171 2.8725 6.3322 1.5362 6.4979 31.6801 95.7215 2.4123 0.5940 17.3455 7.2695 1.4269 58.3321 93.3826 16.5202 9.1666 72.0240 8.5532 29.3132 0.2721 14.8627 93.6297 37.3753 9.9369 63.5838 0.9521 17.7646 35.7486 0.1768 12.4048 23.5804 22.2583 0.1840 2.7081 1.0470 0.4881 0.2055 5.1158 4.4484 23.2429 3.2205 8.5571 59.8199 1.5330 4.9408 2.2593 6.7851 44.7114 1.2436 3.2288 14.8804 128.6923 133.6645 243.6438 42.8263 10.1610 51.8280 70.8534 29.7835 0.0786 153.8198 25.6588 224.6781 47.1543 98.9382 45.3879 214.6942 26.4852 165.6172 9.9312 1.8978 2.6926 15.7544 37.5375 0.5889 8.7709 21.2011 17.0904 5.3109 35.4650 46.1761
temp: 298.150 k
press: 1.00000 atm
elementType: 8 8 8 7 7 6 6 6 6 6 6 6 6 6 6 6 6 6 6 6 6 1 1 1 1 1 1 1 1 1 1 1 1
symmnumber: 1
zpe: 645466.7 jmol-1
zpe.correction: 0.245845 hartree
zpe.thermalcorrener: 0.263056 hartree
zpe.thermalcorrenthalpy: 0.264000 hartree
zpe.thermalcorrgfe: 0.198342 hartree
zpe.sumelectzpe: -950.603205 hartree
zpe.sumelectthermal: -950.585995 hartree
zpe.sumelectthermalent: -950.585051 hartree
zpe.sumelectthermalfe: -950.650709 hartree
dipole: 1.5998 5.9039 -1.6689
dipole: 6.3404
quadrupole: -114.0643 -123.1921 -124.4000
quadrupole: -18.4026 2.7781 5.3581
quadrupole: 6.4878 -2.6400 -3.8479 -18.4026 2.7781 5.3581
hfenergy: -950.8490504 hartree
pointgroup: C01 [X(C16H12N2O3)]
dipole: -0.5541518 2.385318 0.4751169 debye
polarizability: 371.73025|-23.6391472|216.9429129|-10.3369519|-10.6129532|99.2406298 unknown
InChI: InChI=1S/C16H12N2O3/c19-13-10-15(21-14-9-5-4-8-12(13)14)16(20)18-17-11-6-2-1-3-7-11/h1-10,17-18H
charge 0 multiplicity 1
33 atoms
O  1.20477 0.232952 0.354056
O  4.290806 -2.439442 -0.593978
O  -0.877764 -2.72458 0.279737
N  -1.320084 -0.462244 0.598499
N  -2.659602 -0.724996 0.906591
C  3.596342 -0.162234 -0.117694
C  2.527112 0.71372 0.204564
C  0.968131 -1.140964 0.174998
C  3.355876 -1.623547 -0.30771
C  1.957715 -2.038499 -0.134258
C  4.896102 0.392776 -0.251472
C  2.717663 2.097947 0.39356
C  -0.466533 -1.52106 0.343149
C  5.108728 1.769625 -0.068413
C  4.017048 2.621576 0.254651
C  -3.696388 0.006971 0.273409
C  -5.041023 -0.337989 0.584249
C  -3.433712 1.09317 -0.602871
C  -6.102402 0.393455 0.017975
C  -4.510245 1.82401 -1.152555
C  -5.847675 1.484328 -0.84919
H  1.685406 -3.090214 -0.251652
H  5.712555 -0.293276 -0.500193
H  1.864356 2.735612 0.642315
H  6.113917 2.189879 -0.17345
H  4.183593 3.694354 0.397659
H  -0.957501 0.471271 0.807398
H  -2.80278 -1.723957 1.098532
H  -5.245731 -1.168965 1.269744
H  -2.405035 1.343294 -0.882118
H  -7.13403 0.114116 0.259342
H  -4.297937 2.656766 -1.832589
H  -6.676674 2.053045 -1.282288
