program: Gaussian 09
title: 000208639
version: EM64L-G09RevD.01
frameworkgroup: C1[X(C16H13N3O)]
method: RPBEPBE
basis: SDD
operation: Freq
keyword: #p
keyword: freq=noraman
keyword: PBEPBE/SDD
title: #p freq=noraman PBEPBE/SDD
converged: NO YES NO YES
title: Mulliken charges:
elementType: O N N N C C C C C C C C C C C C C C C C H H H H H H H H H H H H H
charge: -0.253086 -0.323202 -0.419899 -0.020443 0.271267 0.247798 0.062839 -0.562701 0.391075 -0.586994 0.390099 0.108005 0.119439 0.111436 -0.822185 -0.819101 -0.319066 -0.366231 -0.252692 -0.210071 0.333307 0.304015 0.244743 0.225321 0.242729 0.225276 0.230633 0.229927 0.229865 0.267377 0.258377 0.231769 0.230372
chargesum: 0.00000
title: Mulliken charges with hydrogens summed into heavy atoms:
elementType: O N N N C C C C C C C C C C C C C C C C
charge: -0.253086 -0.323202 -0.086593 -0.020443 0.271267 0.247798 0.062839 -0.258687 0.391075 -0.342251 0.390099 0.108005 0.119439 0.111436 -0.128858 -0.128676 -0.051689 -0.107854 -0.020923 0.020301
polarizability: 3.76562723e+02 1.63870028e+00 1.98577247e+02 -9.79363438e-03 2.10199810e-02 8.27563000e+01
1716.lowfreq: -5.9871 -0.0006 0.0003 0.0007 1.2313 10.1285 48.2007 76.2800 106.0020
frequency: 48.1971 76.2511 105.9227 116.1341 123.4222 147.8528 170.8860 181.9162 240.8215 269.3161 290.1168 297.9648 308.9444 331.4603 342.6369 392.3142 439.2552 442.8735 449.4978 467.6772 517.8431 537.4720 539.3456 556.4520 566.7686 639.8657 644.0967 662.5217 677.6098 704.1557 719.7966 756.2492 757.0426 777.4108 785.3094 793.0111 846.0054 861.1072 880.0961 890.9508 913.5141 976.9464 987.7930 998.5129 999.4492 1013.8750 1030.5347 1032.9031 1052.4926 1092.1736 1104.4098 1140.4977 1163.6199 1188.4037 1199.0801 1230.4331 1240.3579 1249.0839 1280.1062 1323.4697 1338.9687 1341.1560 1383.1792 1394.2211 1400.9360 1409.2349 1440.3019 1454.6800 1459.4741 1460.2600 1475.9935 1481.6356 1485.1768 1489.1082 1551.7449 1583.5471 1609.0098 1613.8298 1643.7708 1645.7034 2969.6730 2971.1939 3039.8064 3045.0003 3083.5346 3090.8060 3132.8126 3144.2167 3146.5648 3161.6300 3171.6484 3187.4642 3622.0954
redmass: 5.4107 3.3450 1.0811 4.7698 4.8617 2.6918 1.5681 2.8273 4.1804 5.3424 3.2169 5.4900 3.5507 7.1166 4.6429 5.3483 3.0254 4.6346 3.5482 6.1478 7.0507 6.1095 2.8125 1.2469 5.4199 6.0307 4.0774 5.8052 5.6134 6.6160 6.5339 3.8041 5.0579 1.6526 6.4438 2.8494 5.1592 1.4227 5.3770 1.5327 1.3410 1.3707 2.1088 1.3278 1.5351 2.0734 1.4412 2.0144 1.6289 3.6751 3.3723 3.0142 1.1436 1.7050 2.8830 1.6940 4.1567 1.9228 1.6763 3.1677 4.1117 4.8072 7.8554 1.2449 2.6424 1.5369 1.8867 2.6427 1.0469 2.9898 1.0456 1.1320 3.7156 1.7144 6.5422 8.7787 9.3166 7.2720 7.3955 9.4089 1.0378 1.0383 1.0970 1.0968 1.0985 1.0975 1.0859 1.0923 1.0896 1.0953 1.1001 1.0938 1.0810
irintensity: 2.7735 0.1220 0.0225 1.3763 1.2916 1.6079 0.4614 0.0515 2.1158 5.9819 0.4974 2.1670 0.2256 2.6247 1.2769 0.6655 2.9362 0.3114 5.0737 0.1809 0.3847 0.1713 4.2989 133.7651 0.7863 7.1083 0.8315 5.3936 7.2456 9.1252 12.1097 1.1570 14.3382 72.2188 5.5131 7.6822 0.2537 28.2482 10.5348 1.2353 14.6409 2.9005 3.6379 0.0001 11.2511 52.1134 19.2416 2.9245 0.1387 12.2629 17.5713 14.2866 2.3402 5.0371 9.3537 21.4587 14.3402 6.4242 8.2302 17.9897 47.1779 11.4788 20.2745 8.6341 3.0161 18.7595 3.9343 45.1292 1.2078 95.5389 31.4922 8.3992 135.0329 47.9809 4.3551 370.8707 105.2617 335.9226 186.2687 311.6405 80.3255 13.1355 37.8913 3.8877 27.3499 11.0601 6.0094 11.1574 6.2607 13.4677 30.4352 1.4600 94.0240
temp: 298.150 k
press: 1.00000 atm
elementType: 8 7 7 7 6 6 6 6 6 6 6 6 6 6 6 6 6 6 6 6 1 1 1 1 1 1 1 1 1 1 1 1 1
symmnumber: 1
zpe: 669924.3 jmol-1
zpe.correction: 0.255161 hartree
zpe.thermalcorrener: 0.270951 hartree
zpe.thermalcorrenthalpy: 0.271895 hartree
zpe.thermalcorrgfe: 0.212693 hartree
zpe.sumelectzpe: -855.669275 hartree
zpe.sumelectthermal: -855.653485 hartree
zpe.sumelectthermalent: -855.652541 hartree
zpe.sumelectthermalfe: -855.711742 hartree
dipole: -2.9972 -2.6309 -0.0005
dipole: 3.9881
quadrupole: -90.3971 -111.1894 -120.7555
quadrupole: 3.6926 -0.0025 0.0038
quadrupole: 17.0502 -3.7420 -13.3082 3.6926 -0.0025 0.0038
hfenergy: -855.9244356 hartree
pointgroup: C01 [X(C16H13N3O1)]
dipole: -1.1921784 -1.0200754 -0.0001863 debye
polarizability: 376.5756904|-0.6141345|198.5642797|-0.0095268|0.0211422|82.7563 unknown
InChI: InChI=1S/C16H13N3O/c1-9-7-13-14(8-10(9)2)19-15(20)11-5-3-4-6-12(11)17-16(19)18-13/h3-8,18H,1-2H3
charge 0 multiplicity 1
33 atoms
O  0.721256 2.31024 0.000134
N  0.122714 0.044093 -0.000088
N  -0.674047 -2.061152 -0.00053
N  1.73813 -1.79677 -0.000509
C  -1.296241 0.136279 -0.000194
C  -1.790764 -1.19905 -0.000479
C  0.505713 -1.32178 -0.00041
C  -2.16876 1.236855 -0.000046
C  -3.565097 0.99006 -0.000206
C  -3.170903 -1.455673 -0.000646
C  -4.066097 -0.355368 -0.000514
C  1.090374 1.098545 0.000217
C  2.475038 0.593685 -0.000115
C  2.751263 -0.823094 -0.00041
C  -4.529258 2.163803 0.000085
C  -5.562756 -0.611194 -0.000569
C  3.547823 1.526892 -0.000124
C  4.109296 -1.254114 -0.000656
C  4.87702 1.081101 -0.000372
C  5.153461 -0.317681 -0.00064
H  -0.676699 -3.078227 -0.000981
H  -1.76788 2.252451 0.000167
H  -3.559463 -2.479381 -0.0009
H  -5.189927 2.149774 0.888619
H  -3.986437 3.123305 -0.000488
H  -5.191102 2.149362 -0.887554
H  -5.786835 -1.691295 -0.002144
H  -6.050609 -0.165836 0.887718
H  -6.051082 -0.163106 -0.887199
H  3.298814 2.59344 0.000106
H  4.301941 -2.331219 -0.000869
H  5.701038 1.802087 -0.000359
H  6.192779 -0.665031 -0.000839
