program: Gaussian 09
title: 000208602
version: EM64L-G09RevD.01
frameworkgroup: C1[X(C4H7N3O2S)]
method: RPBEPBE
basis: SDD
operation: Freq
keyword: #p
keyword: freq=noraman
keyword: PBEPBE/SDD
title: #p freq=noraman PBEPBE/SDD
converged: YES YES NO NO
title: Mulliken charges:
elementType: S O O N N N C C C C H H H H H H H
charge: -0.038598 -0.408600 -0.415697 -0.106204 -0.123720 -0.013402 -0.091876 -0.300558 -0.183026 -0.299180 0.247711 0.228197 0.280375 0.254803 0.238067 0.366909 0.364800
chargesum: 0.00000
title: Mulliken charges with hydrogens summed into heavy atoms:
elementType: S O O N N N C C C C
charge: -0.038598 -0.041691 -0.050897 -0.106204 -0.123720 -0.013402 -0.091876 0.175350 0.097348 0.193690
polarizability: 9.74678782e+01 -7.53966043e-01 1.06413875e+02 -2.35406815e-01 2.03204843e+00 4.99555908e+01
1716.lowfreq: -13.6845 -8.1635 -5.3124 0.0011 0.0014 0.0017 68.2124 74.2385 89.4980
frequency: 68.2119 74.1792 89.4456 167.0160 197.4183 218.8393 244.1326 365.6847 430.0398 456.9645 528.8741 542.7174 560.7935 617.7959 625.1972 698.1405 769.7002 797.6905 923.8567 977.6082 983.9942 1007.1552 1018.0689 1082.7009 1149.6659 1183.1106 1205.8660 1267.7993 1295.7129 1308.9108 1353.5699 1363.2269 1384.8022 1408.1516 1427.3998 1445.6403 1450.5490 1477.9504 3000.6265 3004.8155 3119.5131 3141.1952 3257.4029 3431.3080 3448.6594
redmass: 8.5575 3.4239 4.8051 8.2775 6.1755 3.8906 2.4569 8.1730 3.0567 5.5539 3.1530 1.5046 1.2234 6.5755 4.5237 5.3583 6.5343 1.4044 2.9164 2.0867 4.3325 3.1617 3.2400 2.9064 2.6376 1.5941 1.6885 1.8923 3.1204 2.2355 1.4510 1.4266 1.6103 1.2551 1.7266 1.2734 1.1602 2.7123 1.0674 1.0656 1.1003 1.0980 1.1003 1.0655 1.0657
irintensity: 3.1717 1.7670 8.5770 1.2292 0.3888 16.5352 4.2572 9.5223 18.3124 4.1128 69.3777 164.9162 150.7963 14.9687 5.2271 24.1188 131.5427 23.0668 6.7537 85.2470 147.7056 51.9846 7.1053 38.1428 38.9191 28.6076 141.9676 9.1432 20.2846 48.1162 76.9734 51.9256 71.3555 20.4984 81.8170 3.6542 31.9983 38.0579 38.1824 41.6863 12.4702 3.9846 1.5666 40.0125 24.5512
temp: 298.150 k
press: 1.00000 atm
elementType: 16 8 8 7 7 7 6 6 6 6 1 1 1 1 1 1 1
symmnumber: 1
zpe: 326413.7 jmol-1
zpe.correction: 0.124324 hartree
zpe.thermalcorrener: 0.134114 hartree
zpe.thermalcorrenthalpy: 0.135058 hartree
zpe.thermalcorrgfe: 0.088290 hartree
zpe.sumelectzpe: -868.591334 hartree
zpe.sumelectthermal: -868.581544 hartree
zpe.sumelectthermalent: -868.580600 hartree
zpe.sumelectthermalfe: -868.627368 hartree
dipole: -1.6776 2.1284 -2.4231
dipole: 3.6354
quadrupole: -67.8902 -65.1158 -70.4917
quadrupole: -5.5172 -0.2990 -2.3004
quadrupole: -0.0576 2.7168 -2.6592 -5.5172 -0.2990 -2.3004
hfenergy: -868.715658 hartree
pointgroup: C01 [X(C4H7N3O2S1)]
dipole: -0.6619125 -0.5147233 1.1587187 debye
dipolederiv: -0.483858 0.0263905 -0.0102754 0.0225322 -0.7819797 0.116292 -0.0136461 0.1321146 -0.3087075 -0.7145808 0.1635927 0.0051576 0.1585135 -0.3391092 0.0684025 -0.1827262 0.084702 -0.6777707 -0.7253125 -0.1596691 -0.0210796 -0.2027448 -0.3283115 0.0967623 0.1875633 0.080548 -0.667112 -0.8997867 -0.256159 -0.0082694 0.2246179 -0.7082687 0.1831154 -0.029038 0.1752659 -0.1972129 -0.6962543 0.3740381 -0.0281744 -0.1684944 -0.5220894 0.1380508 -0.0025227 0.1663967 -0.1937657 -0.3617733 0.080779 -0.0295075 0.3580523 -0.1491378 0.0090801 -0.0329342 -0.0195971 -0.1674744 0.427027 -0.0522599 0.0175631 -0.0258793 1.3264087 -0.3228269 0.0108291 -0.3420999 0.0207541 1.0419137 -0.0372687 0.0937506 -0.2757684 0.3707576 -0.1157605 0.1816512 -0.0717409 0.7220279 0.2119702 -0.1471533 0.0459819 -0.3787602 0.3516885 -0.0775737 0.0545007 -0.069469 -0.0094703 1.0505035 0.0474876 -0.0867746 0.2994989 0.3539733 -0.1182871 -0.1836429 -0.0592336 0.7102678 0.0342217 -0.0025291 -0.0560653 0.1016408 0.0044239 -0.108113 -0.0171123 -0.0475588 -0.084659 0.0272231 -0.0362249 0.0155533 -0.0971567 -0.0304257 0.0902377 -0.0020034 0.035394 0.0649011 0.0663264 -0.0408021 0.0061375 -0.0229555 0.0858192 0.0199121 -0.0029408 0.0155031 0.1918477 0.0611545 0.0272504 -0.0067288 0.0801064 0.0068094 0.0720431 0.005541 0.0217715 0.0814829 0.0161263 0.0011667 0.0450462 -0.1056229 0.0078402 -0.1102134 0.012688 -0.0525569 -0.1030903 0.4776111 -0.1688156 0.0653636 -0.0460887 0.1830132 0.0356175 0.0760906 -0.0235407 0.3143925 0.4674883 0.1801764 -0.0476788 0.078509 0.1685879 0.0232611 -0.0622971 -0.0258989 0.3035889 unknown
polarizability: 97.457094|0.8222714|102.4540389|0.2700951|-14.5725368|53.926211 unknown
InChI: InChI=1S/C4H7N3O2S/c8-2-6-1-5-7(3-9)4(6)10/h1,8-9H,2-3H2
charge 0 multiplicity 1
17 atoms
S  -0.050132 2.092625 -0.182885
O  -2.819781 0.420138 -1.11605
O  2.793459 0.487253 -1.087621
N  -1.107993 -0.452494 0.366563
N  1.080246 -0.414186 0.372726
N  0.725436 -1.765307 0.5950
C  -0.016077 0.413578 0.201758
C  -2.50918 0.017815 0.228261
C  -0.613394 -1.738315 0.582618
C  2.487345 0.019384 0.238916
H  -2.636209 0.848606 0.949323
H  -3.176093 -0.821568 0.473248
H  -1.235375 -2.617481 0.723829
H  3.108191 -0.866459 0.427064
H  2.661168 0.803148 1.001973
H  -2.307834 1.255542 -1.310282
H  2.300127 1.341324 -1.238038
