program: Gaussian 09
title: 000208601
version: EM64L-G09RevD.01
frameworkgroup: C1[X(C10H11N3OS)]
method: RPBEPBE
basis: SDD
operation: Freq
keyword: #p
keyword: freq=noraman
keyword: PBEPBE/SDD
title: #p freq=noraman PBEPBE/SDD
converged: YES YES NO NO
title: Mulliken charges:
elementType: S O N N N C C C C C C C C C C H H H H H H H H H H H
charge: 0.254399 -0.413479 -0.159431 -0.086895 -0.046746 -0.792504 0.470589 -0.049888 -0.369248 -0.378960 -0.316202 -0.219486 -0.220198 -0.233187 -0.308684 0.292800 0.305488 0.241386 0.237961 0.238670 0.238992 0.230086 0.229680 0.231931 0.263554 0.359369
chargesum: 0.00000
title: Mulliken charges with hydrogens summed into heavy atoms:
elementType: S O N N N C C C C C C C C C C
charge: 0.254399 -0.054109 -0.159431 -0.086895 -0.046746 -0.194216 0.470589 -0.049888 -0.127862 -0.140999 0.161461 0.010600 0.009483 -0.001256 -0.045129
polarizability: 2.24877811e+02 1.88471184e+01 1.15070004e+02 -3.73602455e+00 7.23284406e-01 1.11136423e+02
1716.lowfreq: -10.1636 -5.7969 -0.0027 -0.0022 -0.0015 2.6288 11.2201 17.6782 42.0425
frequency: 9.3217 17.6317 42.0253 47.1829 65.5535 127.5474 131.3077 189.5307 218.2652 254.8607 322.9412 358.4139 401.9777 428.7476 435.7926 474.6553 480.1948 554.1139 616.3537 632.6922 642.7771 676.0887 701.9433 730.9276 776.5603 810.3997 850.7442 853.0361 886.6392 915.4920 925.1919 928.8091 968.5291 978.7259 990.1401 998.7149 1026.2180 1044.5084 1075.4272 1125.2389 1144.0018 1159.2041 1173.9538 1188.5153 1220.4600 1228.0940 1247.9088 1259.4264 1306.4278 1325.7339 1335.2926 1378.2333 1384.9500 1400.2240 1409.6100 1440.4387 1449.2465 1451.6768 1483.8958 1593.4519 1613.6148 3026.5158 3058.0620 3116.4136 3123.6649 3126.1074 3136.5380 3138.3194 3150.5527 3166.6157 3251.1879 3561.0280
redmass: 4.9338 4.4725 6.1897 5.6532 4.2909 6.6065 8.0339 3.2989 8.1892 4.3559 2.2674 1.7817 2.8008 3.3295 2.7378 4.9101 5.2925 6.1445 6.3305 5.2979 5.3246 6.5504 1.6636 6.1012 2.1660 3.9028 1.3656 1.2500 1.5233 2.4259 10.7943 1.4505 6.4281 1.3910 6.1945 1.3228 2.1993 2.1034 1.4957 1.0793 2.5228 3.0724 1.0527 1.1124 2.1466 2.8268 1.5932 1.7582 4.3556 1.2783 1.6757 2.3093 8.7726 3.0371 1.3443 2.1786 1.1258 1.1035 2.3516 6.0879 6.1064 1.0619 1.0582 1.1044 1.0858 1.0882 1.1087 1.0921 1.0964 1.1017 1.0987 1.0661
irintensity: 0.0758 0.2364 1.5829 1.1134 3.3145 3.1781 0.2868 2.8988 0.3076 4.7537 0.8462 77.5093 0.0753 79.9875 52.8457 5.6429 27.4645 25.7023 0.2041 38.4642 17.9667 6.9168 66.4873 57.0071 30.1357 15.7230 19.8924 0.0123 0.2355 72.1609 9.0102 3.0677 130.5472 0.0010 0.6253 0.0624 5.3373 26.1493 9.1813 1.3454 17.6426 5.1394 0.0185 1.8402 1.1487 25.5787 91.1805 47.0640 79.8843 0.3240 56.9884 116.9833 0.4780 23.1985 8.4180 9.2062 12.3749 21.7937 10.0350 0.9453 0.2686 39.3119 4.8685 6.9360 4.9313 1.0158 1.7647 13.9130 37.0712 22.6489 3.8533 17.5783
temp: 298.150 k
press: 1.00000 atm
elementType: 16 8 7 7 7 6 6 6 6 6 6 6 6 6 6 1 1 1 1 1 1 1 1 1 1 1
symmnumber: 1
zpe: 518967.5 jmol-1
zpe.correction: 0.197664 hartree
zpe.thermalcorrener: 0.211809 hartree
zpe.thermalcorrenthalpy: 0.212753 hartree
zpe.thermalcorrgfe: 0.151974 hartree
zpe.sumelectzpe: -1024.076246 hartree
zpe.sumelectthermal: -1024.062102 hartree
zpe.sumelectthermalent: -1024.061158 hartree
zpe.sumelectthermalfe: -1024.121937 hartree
dipole: 1.1917 -0.0431 -0.7694
dipole: 1.4191
quadrupole: -81.3740 -101.6913 -88.5578
quadrupole: 0.8879 -0.0864 -0.4946
quadrupole: 9.1670 -11.1503 1.9832 0.8879 -0.0864 -0.4946
hfenergy: -1024.2739103 hartree
pointgroup: C01 [X(C10H11N3O1S1)]
dipole: -0.4658405 -0.0710304 0.2994459 debye
dipolederiv: -0.8209107 0.0170301 0.0016555 0.0559808 -0.0210142 -0.0034013 -0.0153514 -0.0069263 -0.0559791 -0.3994228 -0.3289677 -0.0660898 -0.484697 -0.7690303 0.0252643 0.0431868 0.2665785 -0.6064942 -0.4187887 -0.0682615 0.0192563 -0.3974773 -0.7773857 -0.1138498 -0.1932072 -0.3040244 -0.2395122 -0.7217562 0.1279059 0.0278273 0.3985649 -0.6603764 -0.1576636 0.1211896 -0.1987515 -0.2542485 -0.7272625 -0.2069797 -0.0923516 0.0070406 -0.0637454 0.0370383 0.0017611 0.053522 -0.1746026 0.7662255 0.1345378 0.0429766 0.3563819 0.1937815 0.0133233 0.1549254 0.0070845 0.1117799 0.0927553 -0.0097938 -0.0039498 -0.0613995 -0.0848922 -0.0191134 -0.0087666 -0.0186394 -0.0155619 1.216694 0.0296654 0.0105025 -0.5852266 0.4206525 0.1550963 -0.1754986 0.2071916 0.0767775 -0.0637073 -0.0076583 -0.0959085 -0.013233 -0.1202182 -0.0312333 -0.0157021 -0.036116 0.0287339 -0.0803524 -0.0628064 0.0638097 -0.0251092 -0.095673 -0.0723122 -0.0160669 -0.0683686 0.0178968 0.5240995 0.3283099 -0.0073937 0.6667452 1.1664574 -0.0528622 0.0358467 -0.1150867 0.6560836 -0.072526 -0.0634571 0.0783235 -0.0588654 -0.0875269 -0.0950048 0.1102341 -0.0856421 0.0465513 -0.0509935 -0.0024059 -0.1123937 0.0231891 -0.1251067 -0.0346684 -0.1320264 -0.0416014 0.0639924 0.0546593 -0.083277 -0.0219741 -0.0677147 -0.1195258 -0.0284748 -0.0204046 -0.0286535 -0.0556423 0.460486 -0.1749187 -0.0188729 -0.1558917 0.1708445 0.1143587 -0.0415199 0.0973061 -0.0194651 -0.0218105 -0.0145408 -0.0077532 -0.0737328 -0.0310984 0.0426383 -0.0740911 0.0619621 0.0201024 -0.0045945 -0.0148921 0.0032671 -0.0981728 0.0372913 -0.0283739 0.0160487 -0.0470184 -0.0209343 0.0505527 0.0070953 0.1043205 0.0016534 0.1263153 0.0241436 0.1009529 0.0309227 -0.0265179 0.0631075 0.0671834 -0.0766579 0.0579329 0.0930755 0.0802835 -0.0721885 0.0722458 -0.01344 0.0155791 0.0295591 0.1163395 0.0071498 0.031306 -0.0134924 0.0756712 0.0241645 0.0488084 -0.06158 -0.036517 -0.1336954 -0.0024579 -0.0099335 0.0786279 -0.0514927 0.0469753 -0.026924 0.0335773 0.0558909 -0.0620957 0.073671 0.1064711 0.0884545 -0.0805484 0.0889778 -0.0359637 0.0168768 0.0059987 0.0937565 0.0099088 0.1394504 0.0440967 0.1182827 0.0426518 -0.0547624 -0.1135783 0.0786789 0.0179683 0.0826429 0.1274354 0.0168731 0.0184699 0.0167423 0.0952912 0.0475481 0.0416827 0.013236 0.0549388 0.0404186 -0.0545729 0.0206383 -0.0551821 0.1513904 0.2151223 0.1509378 0.1058971 0.228178 0.3120271 -0.0151759 0.0796573 -0.0103146 0.2826404 unknown
polarizability: 226.2950118|-13.3112096|113.7523726|-5.8600932|-0.5265624|111.0368538 unknown
InChI: InChI=1S/C10H11N3OS/c14-8-13-10(11-7-12-13)15-6-9-4-2-1-3-5-9/h1-5,7,14H,6,8H2
charge 0 multiplicity 1
26 atoms
S  0.32406 0.626244 0.302772
O  3.721029 2.640293 -0.195935
N  3.124882 0.341179 0.338857
N  2.060981 -1.451855 -0.497595
N  4.153017 -0.561316 -0.017288
C  -0.842358 -0.849304 -0.147694
C  -2.273378 -0.387344 -0.059115
C  1.890384 -0.211183 0.028155
C  -2.904937 0.221564 -1.175171
C  -3.013553 -0.557749 1.139644
C  3.484769 1.663964 0.851359
C  -4.249337 0.646091 -1.096361
C  -4.358715 -0.134587 1.220322
C  -4.980056 0.468601 0.101998
C  3.444046 -1.611287 -0.504894
H  -0.596567 -1.652363 0.562604
H  -0.539223 -1.157136 -1.158938
H  -2.339129 0.361054 -2.104111
H  -2.533492 -1.025084 2.007935
H  2.638889 2.061616 1.432177
H  4.371195 1.522718 1.495974
H  -4.726569 1.111609 -1.965743
H  -4.920802 -0.275818 2.150068
H  -6.023881 0.796103 0.163083
H  3.934424 -2.510462 -0.868263
H  4.526416 2.377856 -0.71104
