program: Gaussian 09
title: 000208642
version: EM64L-G09RevD.01
frameworkgroup: C1[X(C19H20N4O)]
method: RPBEPBE
basis: SDD
operation: Freq
keyword: #p
keyword: freq=noraman
keyword: PBEPBE/SDD
title: #p freq=noraman PBEPBE/SDD
converged: YES YES NO NO
title: Mulliken charges:
elementType: O N N N N C C C C C C C C C C C C C C C C C C C H H H H H H H H H H H H H H H H H H H H
charge: -0.252459 -0.193674 -0.329318 -0.027137 -0.093764 -0.409909 0.250269 0.108288 0.281632 -0.390583 -0.353250 0.100913 -0.360067 0.118746 -0.346397 0.102020 -0.229257 -0.225293 -0.319178 -0.365279 -0.617303 -0.631055 -0.254503 -0.209855 0.279478 0.222562 0.207805 0.220178 0.196385 0.224387 0.246214 0.302401 0.228449 0.231835 0.267782 0.254147 0.226856 0.217804 0.190043 0.267416 0.213896 0.186569 0.232191 0.230013
chargesum: 0.00000
title: Mulliken charges with hydrogens summed into heavy atoms:
elementType: O N N N N C C C C C C C C C C C C C C C C C C C
charge: -0.252459 -0.193674 -0.329318 -0.027137 -0.093764 0.092130 0.250269 0.108288 0.281632 0.037399 0.067522 0.100913 -0.113853 0.118746 -0.043996 0.102020 -0.000808 0.006543 -0.051396 -0.111132 0.017400 0.036826 -0.022312 0.020158
polarizability: 2.84284676e+02 -4.53488852e+01 3.52834964e+02 2.35040679e+01 1.47736960e+01 1.23565772e+02
1716.lowfreq: -5.3654 -1.8272 -0.0007 -0.0004 0.0001 4.6757 24.4883 39.6472 46.6256
frequency: 24.3813 39.6190 46.5792 58.4809 71.8231 91.4608 102.7518 138.2260 151.7630 159.4706 177.7623 212.6868 229.7777 255.1904 265.4031 286.6610 300.3776 315.1865 337.2047 346.9603 368.7846 391.3899 407.1461 430.0884 440.9897 455.6263 488.4775 507.4153 536.2408 544.6495 555.8620 573.1420 588.4912 646.5454 673.6286 678.3770 696.4299 699.3740 740.2762 754.4398 757.8492 767.2290 776.2705 793.0323 843.6556 862.9363 864.8405 874.0753 889.3681 897.2290 943.7001 946.0217 976.1179 983.9437 997.2506 997.7113 1015.5639 1021.1295 1033.7023 1038.0179 1046.1288 1076.9942 1083.2983 1092.3666 1100.3635 1117.2523 1134.1158 1153.5279 1160.6687 1164.4795 1178.2126 1191.7452 1212.8843 1241.1468 1254.2202 1270.8984 1276.4901 1295.4292 1299.9569 1311.2670 1334.4643 1341.6357 1353.7763 1367.1777 1372.7307 1384.5814 1414.0338 1419.2088 1439.5599 1452.2126 1454.9983 1458.0551 1464.7579 1465.5564 1470.0820 1472.4467 1476.3070 1480.0612 1482.9795 1484.0062 1552.1558 1575.7759 1609.4095 1614.1369 1620.2480 1637.5242 2847.8479 2858.7896 2875.8236 2989.3209 3005.1917 3018.0239 3020.0231 3031.2502 3051.3702 3074.3313 3077.5321 3083.4615 3132.4614 3138.7387 3146.5827 3155.9018 3160.6032 3169.9054 3171.0601 3200.3952
redmass: 4.2110 4.4664 2.9530 6.1075 3.1734 3.6449 4.0970 5.3622 4.3334 4.2642 5.2248 1.1702 1.5226 1.7662 3.5271 5.0746 2.7452 3.9897 4.8354 5.9619 6.9933 2.0453 2.0523 2.7040 3.2591 3.4186 2.5636 7.5911 4.3706 4.2769 9.9925 4.3549 4.5960 5.7021 6.2117 5.4163 6.6298 5.5963 3.0623 4.6463 1.2986 4.6567 1.6081 2.9311 2.6087 1.7773 2.7300 3.0498 1.5287 3.8954 2.2316 1.3747 1.3697 1.3005 1.5190 2.4095 3.0087 2.0251 2.1683 1.5706 2.5835 1.9123 2.2917 1.4511 2.1249 1.6302 1.4825 1.7655 1.3809 1.2313 1.6000 2.0849 1.8171 2.1511 2.2557 2.3962 1.6584 1.4628 1.6888 3.9790 1.8345 1.4657 1.6256 1.3343 3.2261 8.8090 4.5862 1.1431 1.1559 2.2533 1.1391 2.8977 1.0664 2.1810 1.0890 2.1780 1.0945 1.0812 1.5603 1.1049 6.5591 9.8079 8.1189 8.1965 7.6015 9.0235 1.0573 1.0608 1.0660 1.0603 1.0630 1.0725 1.0737 1.0910 1.0986 1.1006 1.1019 1.1004 1.0860 1.0863 1.0894 1.0918 1.0950 1.0982 1.1004 1.0962
irintensity: 0.1214 0.1208 0.4581 2.7381 1.4124 0.5303 0.0825 2.8050 0.1320 0.9626 0.0149 0.2844 1.8482 0.7209 1.7545 5.4305 4.0360 2.9317 7.9718 3.0128 3.2841 4.1565 2.1357 4.7416 4.2921 9.6775 0.4235 1.6372 4.9083 2.8233 0.3863 1.7721 3.6130 10.1025 2.8571 6.4081 5.7240 3.6102 22.5914 3.6522 90.9172 8.7091 95.1193 3.0942 6.4102 9.7559 16.1703 1.3821 0.9784 0.6869 11.4000 4.4294 2.7931 1.0913 3.1376 10.6342 35.7813 6.6766 22.5053 7.0887 29.1539 8.1351 10.6213 7.6947 7.8357 18.2386 1.6114 8.7403 20.5370 6.5724 38.0362 30.0421 6.5571 20.5806 2.7130 13.5564 8.1079 14.2912 16.8745 25.6240 36.3194 13.7690 14.7026 9.4233 49.9582 15.0045 8.8798 1.0449 4.3459 60.9664 3.1102 94.9928 16.3024 18.7629 3.3297 47.3204 26.4649 9.0589 138.5102 4.5542 3.9271 582.9479 451.6047 43.0983 28.2545 139.8562 90.8925 82.6064 224.9056 25.1585 38.7121 30.2452 48.6116 6.6654 66.4919 28.7770 0.9124 31.0378 5.8374 3.2023 5.6208 19.3620 14.7501 23.0008 25.9573 2.8581
temp: 298.150 k
press: 1.00000 atm
elementType: 8 7 7 7 7 6 6 6 6 6 6 6 6 6 6 6 6 6 6 6 6 6 6 6 1 1 1 1 1 1 1 1 1 1 1 1 1 1 1 1 1 1 1 1
symmnumber: 1
zpe: 933905.0 jmol-1
zpe.correction: 0.355706 hartree
zpe.thermalcorrener: 0.376300 hartree
zpe.thermalcorrenthalpy: 0.377244 hartree
zpe.thermalcorrgfe: 0.305808 hartree
zpe.sumelectzpe: -1028.570162 hartree
zpe.sumelectthermal: -1028.549568 hartree
zpe.sumelectthermalent: -1028.548624 hartree
zpe.sumelectthermalfe: -1028.620060 hartree
dipole: -4.2205 -0.2377 -0.1161
dipole: 4.2288
quadrupole: -135.1953 -124.5347 -145.9367
quadrupole: -10.1972 -0.1690 -1.5652
quadrupole: 0.0270 10.6875 -10.7145 -10.1972 -0.1690 -1.5652
hfenergy: -1028.9258678 hartree
pointgroup: C01 [X(C19H20N4O1)]
dipole: -0.5524881 -1.5689127 -0.0359898 debye
polarizability: 374.9376128|7.404679|262.6452783|-3.4183313|26.3175172|123.1025208 unknown
InChI: InChI=1S/C19H20N4O/c1-21(2)12-7-13-22-16-10-5-6-11-17(16)23-18(24)14-8-3-4-9-15(14)20-19(22)23/h3-6,8-11H,7,12-13H2,1-2H3
charge 0 multiplicity 1
44 atoms
O  0.146394 3.582468 0.623416
N  -1.214743 -0.648693 -0.577713
N  -0.43308 1.398183 0.001054
N  1.196771 -0.336043 -0.563079
N  0.659181 -4.079534 0.275629
C  -1.267991 -2.053039 -1.025609
C  -2.328909 0.173516 -0.301899
C  -0.044203 0.08983 -0.395534
C  -1.849221 1.467111 0.064159
C  -1.61208 -3.038571 0.116136
C  -0.383166 -3.323628 1.010374
C  0.524557 2.42696 0.268015
C  -3.708068 -0.099087 -0.356713
C  1.912978 1.971719 0.078816
C  -2.721733 2.518539 0.391173
C  2.199694 0.618173 -0.330215
C  -4.591786 0.957866 -0.030582
C  -4.109483 2.240365 0.338253
C  2.976821 2.887476 0.303827
C  3.560688 0.231037 -0.502468
C  0.399028 -5.530838 0.231258
C  2.034829 -3.763863 0.711833
C  4.308825 2.48555 0.130099
C  4.596093 1.149708 -0.276316
H  -0.273333 -2.317019 -1.425477
H  -2.008907 -2.118598 -1.844183
H  -1.96928 -3.983473 -0.336524
H  -2.44399 -2.642823 0.731004
H  -0.70877 -3.857858 1.937576
H  0.05371 -2.360854 1.334154
H  -4.08798 -1.085002 -0.639924
H  -2.328115 3.498209 0.667542
H  -5.671839 0.778886 -0.063511
H  -4.822828 3.033122 0.585622
H  2.719142 3.906014 0.613183
H  3.763804 -0.796335 -0.82026
H  1.132786 -6.020221 -0.434188
H  -0.607931 -5.730307 -0.176812
H  0.463091 -6.020957 1.236841
H  2.204877 -2.678461 0.609151
H  2.756691 -4.288405 0.05904
H  2.249217 -4.064868 1.768436
H  5.126043 3.193112 0.303747
H  5.63732 0.837233 -0.414538
