program: Gaussian 09
title: 000208615
version: EM64L-G09RevD.01
frameworkgroup: C1[X(C14H23N3O)]
method: RPBEPBE
basis: SDD
operation: Freq
keyword: #p
keyword: freq=noraman
keyword: PBEPBE/SDD
title: #p freq=noraman PBEPBE/SDD
converged: YES YES NO NO
title: Mulliken charges:
elementType: O N N N C C C C C C C C C C C C C C H H H H H H H H H H H H H H H H H H H H H H H
charge: -0.364178 -0.150621 -0.386046 -0.687410 -0.355873 -0.451215 -0.293735 -0.313681 -0.371417 -0.696464 -0.685628 0.199462 0.124545 0.311794 -0.308686 -0.399051 -0.303215 -0.206153 0.195798 0.227787 0.237192 0.207262 0.181041 0.205273 0.189712 0.223178 0.213144 0.257047 0.216239 0.220141 0.229156 0.226104 0.211272 0.213398 0.348480 0.202933 0.214763 0.226156 0.221496 0.378968 0.291031
chargesum: 0.00000
title: Mulliken charges with hydrogens summed into heavy atoms:
elementType: O N N N C C C C C C C C C C C C C C
charge: -0.364178 -0.150621 -0.037566 -0.017410 0.067712 -0.006760 0.092579 0.099209 0.098774 -0.030928 -0.034854 0.199462 0.124545 0.311794 -0.105753 -0.184288 -0.077060 0.015342
polarizability: 2.27305550e+02 8.43071631e+00 1.95825424e+02 -1.75413124e+01 9.91482766e+00 1.24309178e+02
1716.lowfreq: -18.6398 -6.4966 -0.0007 -0.0005 -0.0003 8.6845 11.9935 23.0100 40.8651
frequency: 8.7823 22.9587 40.0895 51.9732 60.7898 74.8384 92.5060 124.0780 140.0833 184.7827 193.9603 207.5382 221.6484 246.3012 265.6903 287.9833 296.8772 333.8036 348.8504 403.2290 404.5353 421.0272 433.4306 447.2648 464.5777 490.9529 528.7024 553.0622 602.2308 653.7574 677.8297 705.9487 727.6962 748.5254 756.9159 761.1780 790.3524 792.0855 802.3730 808.1606 844.7957 847.4014 874.7611 913.1579 932.5990 950.0185 969.0422 971.2487 1024.8025 1040.4796 1051.8894 1063.5149 1068.5442 1075.7446 1085.0039 1094.9642 1122.7374 1149.8492 1160.3404 1165.8016 1177.2822 1193.4054 1214.4317 1236.0077 1265.9979 1284.2403 1287.2011 1288.9420 1292.3790 1333.0670 1341.3312 1356.5091 1363.5066 1370.0780 1376.9183 1392.9982 1396.7360 1400.6966 1431.9581 1455.5377 1465.3722 1466.3617 1470.9170 1474.9025 1476.8582 1478.1228 1482.3387 1487.7328 1491.1181 1498.0026 1523.8198 1576.3539 1603.3762 1631.3063 2857.7163 2862.0947 2875.9872 2985.6431 2988.3954 2989.2537 2994.9344 3035.6552 3038.5946 3044.1924 3057.2898 3080.4285 3081.2242 3085.2200 3088.2981 3090.3186 3115.3060 3121.2738 3139.1775 3163.6087 3319.9159 3462.7868 3640.2424
redmass: 3.5175 4.3394 4.3198 2.0107 3.1991 5.4330 2.4674 2.3803 4.2208 1.9409 2.3660 1.7760 1.4555 3.6938 2.4384 1.8833 2.8332 2.5520 4.3083 6.3038 2.9450 2.2468 2.3803 1.5298 2.5956 3.2318 3.2382 6.5529 2.8986 6.0486 3.8164 1.9187 1.3722 1.8436 1.7865 1.5901 1.1752 1.9915 1.4937 1.3453 1.6499 3.3235 2.5158 2.0264 1.3989 2.0352 1.3326 2.1501 2.4456 2.3912 2.1691 1.8508 1.9087 2.3368 2.0706 2.0629 2.1743 1.6470 1.8190 1.8177 1.1881 2.3343 1.3455 1.3833 1.3172 1.1912 1.1416 1.5684 1.8914 1.8545 1.3575 1.3238 1.3190 1.3520 1.3640 1.2205 1.2214 5.6889 2.4424 1.2120 1.0564 1.0777 1.0732 1.1746 1.0816 1.5494 1.1065 1.1306 1.3575 1.4314 3.4554 6.1496 1.5585 6.8725 1.0724 1.0721 1.0711 1.0359 1.0371 1.0614 1.0658 1.0926 1.0873 1.0872 1.0942 1.0981 1.0979 1.0977 1.1003 1.0996 1.0856 1.0880 1.0938 1.0999 1.0605 1.0780 1.0906
irintensity: 0.4999 0.1714 1.1865 0.1303 0.5350 1.9066 0.1929 1.0613 0.4215 3.8619 1.0314 2.5495 0.6890 2.0867 3.5618 0.8584 0.3483 5.3878 13.9310 3.5616 4.7468 29.7983 33.2721 87.4180 4.0333 13.7707 16.6044 0.4259 6.6690 9.0954 46.4206 34.5306 9.3467 40.0715 25.2191 120.6123 5.6015 7.2592 3.5669 91.2277 2.7174 4.0550 6.7987 2.4222 5.5002 10.1670 0.2934 11.6980 13.7141 40.7208 8.2161 14.3954 13.8150 11.1560 0.8521 13.2062 5.9228 20.6285 17.6292 18.6441 11.1178 18.0174 19.9747 18.4606 13.9207 8.4790 2.6692 19.0710 228.4610 4.1857 5.5802 8.0251 1.8556 6.2885 2.4508 22.0446 11.5655 27.1483 22.7430 55.6229 5.6443 8.5574 2.8734 18.6797 11.9290 27.2534 12.0023 55.4453 65.2381 226.4214 355.7007 91.5877 79.1306 189.4460 37.3812 48.4694 257.2885 27.9119 18.9566 30.2717 68.4663 3.4184 16.4740 9.2546 59.1228 36.5575 57.4160 13.5587 55.4663 40.1849 14.5892 6.2024 40.4255 23.7910 178.7210 191.5163 50.4971
temp: 298.150 k
press: 1.00000 atm
elementType: 8 7 7 7 6 6 6 6 6 6 6 6 6 6 6 6 6 6 1 1 1 1 1 1 1 1 1 1 1 1 1 1 1 1 1 1 1 1 1 1 1
symmnumber: 1
zpe: 928825.1 jmol-1
zpe.correction: 0.353771 hartree
zpe.thermalcorrener: 0.373143 hartree
zpe.thermalcorrenthalpy: 0.374087 hartree
zpe.thermalcorrgfe: 0.303449 hartree
zpe.sumelectzpe: -785.386001 hartree
zpe.sumelectthermal: -785.366628 hartree
zpe.sumelectthermalent: -785.365684 hartree
zpe.sumelectthermalfe: -785.436322 hartree
dipole: -2.6878 1.8083 -1.0620
dipole: 3.4091
quadrupole: -91.4270 -110.3491 -111.9286
quadrupole: 1.6352 -4.9004 2.3834
quadrupole: 13.1412 -5.7809 -7.3604 1.6352 -4.9004 2.3834
hfenergy: -785.7397715 hartree
pointgroup: C01 [X(C14H23N3O1)]
dipole: 1.0638916 0.7923866 -0.1979368 debye
polarizability: 224.808976|-21.72078|158.8881955|-13.7866722|-35.3716775|163.7429812 unknown
InChI: InChI=1S/C14H23N3O/c1-3-17(4-2)11-7-10-16-14(18)12-8-5-6-9-13(12)15/h5-6,8-9,16H,3-4,7,10-11,15H2,1-2H3
charge 0 multiplicity 1
41 atoms
O  -1.138952 -1.953578 1.619538
N  3.070498 0.468543 -0.123691
N  0.526186 -1.020584 0.307075
N  -3.472826 -0.736404 1.758006
C  2.90421 0.276066 1.350167
C  2.564894 -1.174886 1.778642
C  3.199949 1.919663 -0.464514
C  4.225333 -0.310183 -0.667869
C  1.577118 -1.902508 0.825167
C  1.903373 2.731483 -0.286246
C  4.130317 -0.546264 -2.187436
C  -0.790167 -1.102558 0.710855
C  -1.772329 -0.175181 0.069338
C  -3.088335 -0.014101 0.646255
C  -1.455353 0.553389 -1.111173
C  -3.991927 0.919075 0.042827
C  -2.360007 1.451345 -1.704851
C  -3.634074 1.638222 -1.105992
H  3.811043 0.62013 1.909209
H  2.070929 0.927481 1.666402
H  2.125104 -1.120916 2.792505
H  3.480034 -1.792451 1.866216
H  4.019705 2.388679 0.137727
H  3.508572 1.98572 -1.52322
H  5.19447 0.190937 -0.419112
H  4.243453 -1.29156 -0.16238
H  2.132761 -2.317518 -0.037429
H  1.084665 -2.735856 1.353109
H  2.064685 3.771433 -0.62516
H  1.569987 2.777631 0.76535
H  1.0810 2.301543 -0.884949
H  3.189383 -1.068832 -2.43534
H  4.156865 0.397206 -2.761097
H  4.977217 -1.167918 -2.532288
H  0.88085 -0.261138 -0.285301
H  -0.488116 0.389915 -1.601768
H  -4.984905 1.053429 0.489704
H  -2.090182 1.98852 -2.619426
H  -4.351537 2.337904 -1.550413
H  -2.809369 -1.453435 2.091982
H  -4.397617 -0.609944 2.16038
