program: Gaussian 09
title: 000208647
version: EM64L-G09RevD.01
frameworkgroup: C1[X(C12H23O6PS4)]
method: RPBEPBE
basis: SDD
operation: Freq
keyword: #p
keyword: freq=noraman
keyword: PBEPBE/SDD
title: #p freq=noraman PBEPBE/SDD
converged: YES YES NO NO
title: Mulliken charges:
elementType: S S S S P O O O O O O C C C C C C C C C C C C H H H H H H H H H H H H H H H H H H H H H H H
charge: 0.098749 -0.218291 0.203737 0.202520 0.580081 -0.456005 -0.481726 -0.231726 -0.225080 -0.225615 -0.245363 -0.608719 -0.457315 0.403961 0.285393 -0.207418 -0.218045 -0.654633 -0.655153 -0.582404 -0.582512 -0.859154 -0.835466 0.364800 0.273607 0.258714 0.231833 0.228014 0.235927 0.219041 0.212638 0.238034 0.227382 0.210415 0.224506 0.255160 0.276488 0.288509 0.283432 0.284011 0.248257 0.267244 0.326324 0.269005 0.293143 0.253700
chargesum: 0.00000
title: Mulliken charges with hydrogens summed into heavy atoms:
elementType: S S S S P O O O O O O C C C C C C C C C C C C
charge: 0.098749 -0.218291 0.203737 0.202520 0.580081 -0.456005 -0.481726 -0.231726 -0.225080 -0.225615 -0.245363 -0.243919 0.075006 0.403961 0.285393 0.252430 0.236924 0.023420 0.034928 -0.017408 -0.015069 -0.017329 -0.019619
polarizability: 3.01526048e+02 1.20457951e+01 2.30345766e+02 1.56631051e+00 -1.26334018e+00 2.28189818e+02
1716.lowfreq: -24.2671 -16.0065 -10.7980 -4.7197 -0.0020 -0.0015 -0.0004 7.0001 17.4156
frequency: -21.7820 -11.9705 15.9056 23.2324 23.9961 33.6992 40.2367 46.8245 51.0140 56.0584 61.4873 66.6071 69.0440 81.0206 84.3661 87.6616 107.2595 117.1358 119.1866 122.0791 143.7610 154.8840 168.4982 184.1496 204.1522 209.9489 220.1149 231.2868 249.8021 260.8844 264.7067 286.7908 292.5845 302.9054 306.2937 318.4127 323.8648 375.9592 408.9831 436.1124 444.3562 454.1292 545.8610 600.5513 631.1116 633.6485 635.0063 638.7323 659.2435 670.6698 694.7788 696.6468 705.1679 759.4680 782.3727 808.4417 809.5428 810.9556 857.3047 859.9099 870.0267 886.6447 920.8559 924.3815 964.1192 985.3487 995.7089 1011.4786 1016.9506 1022.0337 1028.0754 1032.5422 1094.8686 1102.9858 1104.7509 1113.5284 1127.7907 1135.4783 1218.2113 1234.8002 1236.2057 1249.2609 1250.1347 1259.9814 1297.6063 1306.5693 1311.2401 1337.9658 1347.1886 1350.1305 1351.9760 1362.0269 1392.0430 1399.9385 1406.8843 1409.3248 1441.3971 1447.0280 1449.1841 1456.2044 1460.8022 1461.6302 1476.1457 1479.4418 1479.7340 1484.7186 1490.8986 1636.9111 1646.5792 2985.5513 2990.8454 2993.0784 2996.4909 3015.4102 3019.8613 3043.6453 3050.5126 3051.0940 3052.5142 3060.9320 3061.1103 3087.2131 3092.0482 3104.9746 3110.7708 3123.4898 3137.4030 3142.4668 3147.6929 3148.6716 3149.2970 3153.3214
redmass: 3.7359 4.6711 4.7487 3.4747 6.0217 4.8247 4.3248 3.3384 3.5299 2.3931 3.6980 2.6043 6.7296 6.0879 5.3916 8.4026 2.7575 6.8680 1.5855 3.6778 1.5964 3.1620 4.6489 5.3612 4.2864 4.0597 2.0739 4.6205 1.3717 1.7226 6.9394 3.7322 4.4692 2.8941 6.4873 4.9200 5.0332 5.0003 5.8511 4.0865 4.2188 8.8778 12.0463 5.3498 6.0102 5.4916 5.7590 5.4517 6.6726 9.2020 7.3637 6.8729 6.6714 5.1410 4.1168 4.1846 1.1662 1.1161 5.0168 4.5157 3.9859 2.8505 1.5863 2.0502 1.2040 2.3067 1.2264 2.3949 2.5385 1.6920 2.0327 1.9920 2.7950 2.2097 2.2435 2.2137 1.3949 1.4309 1.3939 1.1357 1.1021 1.1588 1.1466 1.1776 1.2045 1.2092 1.3226 1.4437 1.2669 1.2535 1.1317 1.1294 1.2425 1.2287 1.0855 1.0856 1.0537 1.0499 1.0925 1.0403 1.0419 1.0507 1.0580 1.0580 1.0553 1.0774 1.0705 9.4399 9.4926 1.0525 1.0400 1.0473 1.0448 1.0285 1.0291 1.0608 1.0548 1.1079 1.0551 1.1008 1.0920 1.0982 1.0983 1.1025 1.1023 1.1051 1.1036 1.1035 1.1063 1.1094 1.1083 1.1111
irintensity: 0.3495 0.2112 0.1250 0.2425 0.2180 0.3458 0.5760 3.8066 1.7578 0.4677 0.7210 1.6724 0.6850 3.5051 2.5289 1.9128 4.7417 0.3602 0.8171 1.5997 0.3585 4.8605 1.9044 0.0726 2.1910 10.6504 3.1962 2.8455 1.3609 1.7631 4.6656 5.7147 2.2173 5.1299 0.2281 12.0337 4.4320 20.5038 3.9239 14.6103 2.7894 49.1685 127.2567 3.7163 6.2813 23.5704 6.9249 1.5222 77.8753 3.4014 97.5583 35.1848 34.3057 10.1348 13.4644 25.1395 4.3777 1.6207 84.1884 193.4907 75.9623 70.8616 5.5804 62.6426 9.8142 53.5537 18.0235 109.0745 64.5986 17.2441 32.7553 11.5785 205.2762 9.6372 12.6375 175.7780 4.9042 3.4093 79.9948 25.4832 16.3193 1.3181 2.5289 36.3598 1.5081 4.3120 64.2055 21.8355 7.2581 6.7348 0.9453 4.8256 21.1056 20.6963 25.3607 18.7303 29.2726 14.7152 21.7208 10.6590 5.5945 14.5296 5.9105 3.3964 18.8351 9.2531 10.1781 139.0423 197.3837 22.0741 24.0231 21.1992 25.9774 28.1186 8.8462 4.2887 16.4361 14.9009 21.0914 9.5460 9.0862 19.8463 29.9374 19.9495 33.1705 0.5157 9.1427 6.2215 6.3807 2.5738 0.7902 1.0699
temp: 298.150 k
press: 1.00000 atm
elementType: 16 16 16 16 15 8 8 8 8 8 8 6 6 6 6 6 6 6 6 6 6 6 6 1 1 1 1 1 1 1 1 1 1 1 1 1 1 1 1 1 1 1 1 1 1 1
symmnumber: 1
zpe: 911775.3 jmol-1
zpe.correction: 0.347277 hartree
zpe.thermalcorrener: 0.377466 hartree
zpe.thermalcorrenthalpy: 0.378410 hartree
zpe.thermalcorrgfe: 0.280768 hartree
zpe.sumelectzpe: -2854.034146 hartree
zpe.sumelectthermal: -2854.003957 hartree
zpe.sumelectthermalent: -2854.003013 hartree
zpe.sumelectthermalfe: -2854.100654 hartree
dipole: -1.4776 1.8571 2.6945
dipole: 3.5906
quadrupole: -185.1080 -167.4614 -174.8428
quadrupole: -1.7372 13.2760 -11.2339
quadrupole: -9.3040 8.3427 0.9613 -1.7372 13.2760 -11.2339
hfenergy: -2854.3814229 hartree
pointgroup: C01 [X(C12H23O6P1S4)]
dipole: -0.3613354 -0.7135236 -1.1644197 debye
polarizability: 298.706597|-12.6509289|230.7732235|13.1444021|-3.904964|230.5818117 unknown
InChI: InChI=1S/C8H13O4S3.C4H10O2PS/c1-14-4-11-7(9)3-6(13)8(10)12-5-15-2;1-3-5-7(8)6-4-2/h6H,3-5H2,1-2H3;3-4H2,1-2H3
charge 0 multiplicity 1
46 atoms
S  1.384924 0.340611 2.372125
S  4.922386 -0.379654 1.569412
S  -2.908881 2.634386 -1.867042
S  -1.969984 -3.069789 -2.174234
P  3.037929 0.001367 0.825412
O  2.759479 1.398178 -0.154799
O  2.376705 -1.186244 -0.274292
O  -0.689426 1.584658 -0.515683
O  -1.906891 -2.60317 0.577602
O  -1.259156 2.201708 1.67383
O  -3.236768 -0.679649 0.699809
C  -0.135391 0.047253 1.238124
C  -1.145702 -0.84346 2.01399
C  -0.751916 1.393007 0.868618
C  -2.226778 -1.32597 1.057739
C  3.594584 1.560272 -1.389706
C  2.676391 -2.634288 -0.05358
C  3.138062 2.867963 -2.026932
C  2.180204 -3.365223 -1.297518
C  -1.258855 2.859669 -1.042078
C  -2.772417 -3.165892 -0.499642
C  -4.030974 2.474004 -0.353316
C  -2.272133 -1.252073 -2.5967
H  0.24866 -0.467756 0.342291
H  -1.609268 -0.25352 2.822665
H  -0.614165 -1.709671 2.436225
H  3.41879 0.691617 -2.050545
H  4.660416 1.592072 -1.093156
H  3.766083 -2.74936 0.100428
H  2.14539 -2.970566 0.857661
H  3.717779 3.056987 -2.949359
H  3.291335 3.713539 -1.335662
H  2.067921 2.815341 -2.290713
H  2.373371 -4.448828 -1.188119
H  2.708337 -3.007569 -2.197901
H  1.095749 -3.219294 -1.44073
H  -0.559638 3.185266 -1.82466
H  -1.334089 3.585844 -0.217514
H  -2.876789 -4.232998 -0.261179
H  -3.739279 -2.63825 -0.502249
H  -5.059346 2.590229 -0.729641
H  -3.799891 3.27683 0.362923
H  -3.901286 1.486943 0.112247
H  -3.32558 -0.994021 -2.413783
H  -1.615506 -0.593303 -2.011437
H  -2.04409 -1.149492 -3.668734
