program: Gaussian 09
title: 000208640
version: EM64L-G09RevD.01
frameworkgroup: C1[X(C24H19N3O2)]
method: RPBEPBE
basis: SDD
operation: Freq
keyword: #p
keyword: freq=noraman
keyword: PBEPBE/SDD
title: #p freq=noraman PBEPBE/SDD
converged: YES YES NO NO
title: Mulliken charges:
elementType: O O N N N C C C C C C C C C C C C C C C C C C C C C C C C H H H H H H H H H H H H H H H H H H H
charge: -0.212033 -0.246006 -0.270716 -0.331471 0.032263 0.271578 0.259129 0.116444 0.009837 0.149861 0.108102 0.117795 -0.332191 -0.343056 0.093985 0.364282 0.364393 -0.225673 -0.218809 -0.623930 -0.623459 0.486959 -0.317069 -0.356808 -0.846241 -0.846481 -0.248142 -0.207055 -0.819025 0.306815 0.305155 0.234031 0.234562 0.238184 0.238178 0.270606 0.268385 0.247994 0.233078 0.239929 0.247311 0.233357 0.240246 0.235751 0.234637 0.237517 0.223909 0.223889
chargesum: 0.00000
title: Mulliken charges with hydrogens summed into heavy atoms:
elementType: O O N N N C C C C C C C C C C C C C C C C C C C C C C C C
charge: -0.212033 -0.246006 -0.270716 -0.331471 0.032263 0.271578 0.259129 0.116444 0.009837 0.149861 0.108102 0.117795 -0.025376 -0.037901 0.093985 0.364282 0.364393 0.008359 0.015753 -0.385746 -0.385281 0.486959 -0.046462 -0.088423 -0.125239 -0.125567 -0.012391 0.027582 -0.133710
polarizability: 3.66241778e+02 -4.69842416e+01 3.65021745e+02 4.80878815e-01 1.87947497e-01 1.73289654e+02
1716.lowfreq: -15.1990 -5.9652 0.0001 0.0006 0.0007 3.2551 6.8474 21.5501 36.9564
frequency: -15.1076 21.4508 36.9374 43.2212 52.3791 64.6587 84.0206 93.5960 104.5672 115.8614 132.8128 152.3133 155.2234 170.1896 176.3284 185.8178 227.9475 264.7604 266.5788 270.6219 291.1096 311.5561 324.4520 327.6771 354.4264 365.0123 425.9769 439.3294 446.7261 455.5378 470.8385 512.9585 516.0082 520.0351 534.8186 543.8220 557.8938 563.2986 575.0913 575.7635 610.2205 630.7742 667.5692 676.4788 694.3592 698.8712 726.4550 751.4012 762.1985 775.3267 781.6721 794.8624 795.8499 829.0616 863.4178 866.4628 892.8343 896.1101 898.6653 900.4232 936.5754 951.3883 969.4963 981.8117 997.4413 1003.5216 1005.2929 1016.8104 1017.3557 1018.4214 1028.8341 1042.7766 1043.5795 1045.8883 1051.0957 1054.2154 1097.9404 1111.5156 1136.7017 1164.8086 1166.9779 1175.3941 1191.9399 1222.4290 1231.7771 1255.5967 1256.6052 1277.5180 1298.7702 1305.0663 1320.4727 1328.7795 1363.0782 1387.0945 1395.9885 1396.1431 1397.9258 1408.5330 1417.1397 1444.3721 1450.9478 1456.4523 1462.1094 1465.6346 1472.2257 1472.9027 1473.2230 1474.2552 1482.0915 1493.2010 1556.2764 1577.4882 1582.7358 1586.6943 1609.4360 1611.4974 1620.1984 1621.8805 1634.3853 2972.6810 2973.2530 2974.2497 3052.8453 3053.0512 3055.1998 3083.7151 3087.0550 3087.4606 3115.6775 3119.9074 3136.4444 3143.5534 3150.1314 3164.3747 3164.6409 3173.9900 3202.6067 3216.6547
redmass: 4.7005 4.2482 4.4146 1.0160 6.5648 6.1096 1.7298 1.1907 1.3938 4.4676 5.8311 5.6792 4.9095 4.7259 5.7989 3.1916 2.8746 3.9984 2.5767 6.2915 6.9351 3.9038 5.8885 8.3455 8.6527 5.7471 5.9975 3.5328 6.0135 3.4667 2.9514 3.9852 7.5763 3.8679 5.1666 3.7397 10.0149 4.9075 5.4974 3.9697 3.6435 6.5182 6.7980 5.7458 7.0094 6.2650 6.6759 4.0215 5.2731 1.3334 1.6258 2.7035 6.6696 6.1980 1.3991 5.7204 1.3197 1.3527 1.4920 8.0667 2.2977 3.3749 1.3587 1.3705 1.2982 1.3323 3.7478 1.5847 1.6687 2.9888 3.0005 1.7475 1.5747 1.5712 1.6609 2.7321 2.1676 1.9389 3.8951 1.3041 1.2650 1.5082 2.0844 2.3346 2.6746 1.3983 3.3312 2.6411 2.3340 3.2472 6.2261 3.1529 7.2016 9.1381 1.2309 1.2699 1.2516 6.8333 2.5774 1.9913 2.4996 2.9297 2.7925 3.1766 1.0549 1.0647 1.0569 1.0936 1.1670 1.4749 6.5840 10.0733 10.5402 7.3560 7.8989 8.3632 8.2457 6.3647 9.4181 1.0387 1.0387 1.0386 1.0959 1.0959 1.0950 1.0998 1.0989 1.0987 1.0909 1.0918 1.0862 1.0875 1.0899 1.0954 1.0952 1.1003 1.0959 1.0951
irintensity: 0.2759 0.0509 0.0714 0.2939 3.2801 0.1372 1.3339 0.3162 0.7761 0.2976 4.0929 0.6754 2.5722 1.6389 0.0005 1.8528 0.0154 6.4339 0.3977 0.1150 9.2231 0.4121 0.9765 6.6430 2.0494 0.5646 0.1942 0.0443 2.1295 14.0593 1.0184 0.8670 2.1839 0.1685 14.0980 1.7617 0.2441 0.2758 1.7816 0.2210 18.5413 5.3641 6.8479 11.5480 6.8470 0.5781 0.4195 13.0498 0.0077 65.8272 108.6176 2.6972 4.1166 66.0210 24.0695 4.7867 0.0229 0.0606 0.0938 1.7925 0.0524 0.2398 8.4881 2.2031 0.0007 0.0283 11.0542 1.6039 12.0080 51.0443 76.0501 0.8857 0.1722 0.2499 47.3187 14.9237 3.1314 25.4755 30.6409 19.4296 12.4058 66.1551 26.9041 29.3044 5.2707 0.1663 30.8217 324.5201 44.6255 20.6311 11.6023 313.5251 0.3763 14.0986 17.3121 20.6247 0.1504 0.0963 0.4420 65.7415 14.2789 66.6576 37.6574 113.9878 9.5318 46.0114 2.6027 6.3504 32.8105 9.8547 3.7961 112.6179 411.8727 17.3872 256.6094 29.1052 17.0362 56.4659 176.1213 34.9005 30.7101 22.7326 2.8885 27.3732 20.9982 15.9188 17.5024 22.5077 24.9412 14.6845 4.2049 4.8360 5.9237 10.1688 26.2127 23.8606 2.7107 3.4008
temp: 298.150 k
press: 1.00000 atm
elementType: 8 8 7 7 7 6 6 6 6 6 6 6 6 6 6 6 6 6 6 6 6 6 6 6 6 6 6 6 6 1 1 1 1 1 1 1 1 1 1 1 1 1 1 1 1 1 1 1
symmnumber: 1
zpe: 970128.6 jmol-1
zpe.correction: 0.369502 hartree
zpe.thermalcorrener: 0.393330 hartree
zpe.thermalcorrenthalpy: 0.394274 hartree
zpe.thermalcorrgfe: 0.315687 hartree
zpe.sumelectzpe: -1238.732020 hartree
zpe.sumelectthermal: -1238.708193 hartree
zpe.sumelectthermalent: -1238.707249 hartree
zpe.sumelectthermalfe: -1238.785836 hartree
dipole: -1.7544 1.4883 0.0142
dipole: 2.3007
quadrupole: -157.8844 -161.2892 -164.3093
quadrupole: -17.1331 0.0149 -0.0651
quadrupole: 3.2766 -0.1282 -3.1484 -17.1331 0.0149 -0.0651
hfenergy: -1239.1015228 hartree
pointgroup: C01[X(C24H19N3O2)]
dipole: 0.6737392 -0.6044439 -0.0057301 debye
polarizability: 363.6364521|-46.9287245|367.5649458|-1.347859|3.481938|173.3517793 unknown
InChI: InChI=1S/C24H19N3O2/c1-14-12-15(2)21(16(3)13-14)23(29)27-20-11-7-6-10-19(20)26-22(28)17-8-4-5-9-18(17)25-24(26)27/h4-13H,1-3H3
charge 0 multiplicity 1
48 atoms
O  0.617875 3.368967 0.043484
O  -3.796069 -1.911458 -0.032786
N  -0.523021 1.353321 0.015422
N  -2.046104 -0.349092 -0.010629
N  0.305895 -0.9575 -0.031835
C  -1.84063 1.930229 0.029552
C  -2.784634 0.865364 0.013853
C  -0.657206 -0.06759 -0.010692
C  0.692226 2.10994 0.027015
C  2.008702 1.382625 0.020636
C  -2.550561 -1.688864 -0.033683
C  -1.478813 -2.700796 -0.056771
C  -2.266473 3.27056 0.054802
C  -4.170893 1.09251 0.022887
C  -0.095543 -2.305216 -0.055474
C  2.651471 1.11905 -1.218809
C  2.63403 1.067538 1.257012
C  -3.663363 3.505886 0.064083
C  -4.597778 2.441559 0.048528
C  3.932026 0.521405 -1.199469
C  3.915218 0.471445 1.231014
C  4.583478 0.192475 0.014104
C  -1.821765 -4.078805 -0.080836
C  0.912074 -3.309187 -0.078824
C  1.967734 1.437691 -2.536751
C  1.93189 1.330958 2.577546
C  -0.815488 -5.056515 -0.10351
C  0.554649 -4.666424 -0.102497
C  5.97662 -0.41264 0.011081
H  -1.543097 4.085106 0.066316
H  -4.86816 0.253437 0.010386
H  -4.023902 4.539634 0.0837
H  -5.670154 2.662062 0.056316
H  4.432412 0.310936 -2.153043
H  4.402279 0.221824 2.18202
H  -2.88368 -4.345934 -0.081135
H  1.957093 -2.984956 -0.077467
H  1.60723 2.482229 -2.568633
H  2.654528 1.290182 -3.386897
H  1.092287 0.778845 -2.698501
H  1.564865 2.371473 2.64577
H  2.608811 1.153983 3.429995
H  1.058424 0.661517 2.702481
H  -1.081218 -6.118431 -0.122095
H  1.336824 -5.433253 -0.120367
H  6.752443 0.377533 0.032494
H  6.141759 -1.056264 0.8931
H  6.153608 -1.019362 -0.894494
