program: Gaussian 09
title: 000208625
version: EM64L-G09RevD.01
frameworkgroup: C1[X(C15H17N3O6)]
method: RPBEPBE
basis: SDD
operation: Freq
keyword: #p
keyword: freq=noraman
keyword: PBEPBE/SDD
title: #p freq=noraman PBEPBE/SDD
converged: YES YES NO NO
title: Mulliken charges:
elementType: O O O O O O N N N C C C C C C C C C C C C C C C H H H H H H H H H H H H H H H H H
charge: -0.466078 -0.258452 -0.218651 -0.251903 -0.221752 -0.333937 -0.248028 -0.575654 -0.606619 -0.193450 0.276928 -0.251318 -0.414774 0.194021 0.097954 0.135020 -0.465833 -0.082359 -0.153518 0.294825 0.082415 -0.797214 0.336921 -0.492342 0.282842 0.225527 0.280383 0.266493 0.253874 0.233961 0.279255 0.276983 0.376213 0.235005 0.264177 0.235795 0.247749 0.238131 0.225623 0.345628 0.346161
chargesum: 0.00000
title: Mulliken charges with hydrogens summed into heavy atoms:
elementType: O O O O O O N N N C C C C C C C C C C C C C C C
charge: -0.089864 -0.258452 -0.218651 -0.251903 -0.221752 -0.333937 -0.248028 -0.019416 0.085170 0.089392 0.276928 -0.025791 0.132102 0.194021 0.097954 0.135020 0.022002 -0.082359 -0.153518 0.294825 0.082415 -0.062238 0.336921 0.219161
polarizability: 2.72858400e+02 2.18609838e+01 2.49926018e+02 -2.52695607e+00 1.86133756e+01 1.37842921e+02
1716.lowfreq: -7.3170 -3.6954 -0.0006 -0.0004 0.0005 7.6118 29.0197 30.8424 47.7108
frequency: 28.9709 30.8286 47.6865 53.5117 63.1820 75.1677 81.7389 111.9517 114.7705 122.0280 129.6584 140.6395 167.0882 185.4267 208.7728 223.1922 232.4453 249.3094 269.4119 275.4847 284.4817 300.6544 324.5259 342.0768 357.6910 372.9401 386.7969 412.8387 439.4356 464.0650 479.9317 489.7824 505.0851 514.9783 528.6144 538.9726 547.8079 599.4545 606.7122 638.3740 671.2711 702.3617 721.7060 730.3887 733.6938 745.5197 759.8024 783.4975 820.2719 827.3717 847.8489 870.9200 900.6732 910.1160 958.0192 972.8192 982.1136 986.5015 1019.8165 1037.4366 1039.6209 1066.6800 1087.1575 1102.0854 1104.4792 1142.8523 1152.9394 1162.4070 1179.1410 1210.0713 1232.7352 1249.2526 1263.3911 1264.5401 1280.1573 1304.8408 1312.2380 1322.2471 1355.1398 1365.2996 1381.2001 1389.6605 1391.8583 1437.3741 1443.9706 1446.9148 1450.3750 1452.2481 1455.9566 1461.0981 1466.2303 1468.2546 1481.2451 1531.1950 1548.2934 1550.1238 1583.6906 1588.7575 1640.0372 1660.7464 2980.8614 2984.2213 3006.4305 3040.5029 3042.0811 3058.2481 3075.9409 3108.9994 3119.9470 3121.1680 3129.8434 3131.3821 3290.2985 3471.8724 3554.2543 3603.9987 3711.3568
redmass: 4.3655 4.3925 4.3390 4.9875 5.0468 4.8846 3.8601 4.6623 2.6019 2.7025 2.4022 5.7100 6.9762 5.7421 2.5076 1.4386 4.3131 1.5908 2.0263 4.4362 2.9736 2.9901 5.8254 5.0673 6.2659 3.7001 5.2759 4.7253 4.8803 3.6499 7.4068 3.9914 5.1715 1.1366 2.4629 1.1215 2.4771 5.2495 4.5277 6.1647 6.4232 3.8898 9.4380 5.5514 1.3518 6.4713 4.6482 5.0530 8.4446 4.6473 3.3494 5.0656 3.3741 2.0111 4.7987 5.5411 3.9927 3.3485 2.6221 1.5088 2.3840 2.0179 2.0337 1.2532 2.4946 1.4485 1.5027 1.3576 2.8576 3.2274 2.0909 2.0030 1.3342 1.5008 2.3161 1.4645 4.6420 2.0673 2.2919 1.4730 1.7653 1.2532 1.4761 1.2254 1.1425 3.3508 1.2493 1.0622 2.7761 1.3292 1.3605 2.2590 1.4960 9.5378 8.7938 9.8879 1.3051 9.3594 1.0959 5.1401 1.0856 1.0370 1.0279 1.0627 1.0617 1.0963 1.0874 1.0993 1.1049 1.1036 1.1064 1.1041 1.0682 1.0449 1.0447 1.0986 1.1060
irintensity: 1.6612 2.6916 4.1128 5.0377 3.0518 1.2316 2.3195 0.0692 0.9746 1.3154 5.7858 9.1760 3.6453 2.6888 0.3603 1.0063 2.8045 59.5298 15.8496 8.1896 9.5599 3.7276 6.5543 1.6134 8.3594 31.5483 7.5287 12.8291 11.2494 36.0507 0.3158 10.8755 9.9220 183.8686 71.7843 119.3275 187.9347 15.6899 6.9778 13.0639 7.9842 16.1087 12.9537 7.2142 224.0012 21.7414 10.1713 1.4253 0.2824 0.3936 11.1729 23.6666 5.4949 10.9084 80.1360 125.1936 36.4978 83.4431 32.8866 3.2170 48.6563 9.1563 43.0044 2.8449 151.8340 6.1869 40.4650 4.6264 22.0860 68.7881 64.7674 128.6280 13.5419 11.9589 27.1975 6.3981 174.4290 260.3730 16.9789 25.2480 154.6312 38.8983 35.0284 29.1508 29.4805 29.3813 38.0492 12.5029 7.1269 23.0431 34.5431 55.3400 34.6747 180.1599 317.3359 104.0044 77.3770 9.0323 42.1257 432.4185 58.5447 19.1255 53.6632 5.7565 24.8059 14.8972 15.1202 3.4282 29.7944 3.1767 31.1642 0.2653 432.8249 2.8269 81.1158 2.9179 52.9403
temp: 298.150 k
press: 1.00000 atm
elementType: 8 8 8 8 8 8 7 7 7 6 6 6 6 6 6 6 6 6 6 6 6 6 6 6 1 1 1 1 1 1 1 1 1 1 1 1 1 1 1 1 1
symmnumber: 1
zpe: 821754.0 jmol-1
zpe.correction: 0.312990 hartree
zpe.thermalcorrener: 0.336513 hartree
zpe.thermalcorrenthalpy: 0.337458 hartree
zpe.thermalcorrgfe: 0.259445 hartree
zpe.sumelectzpe: -1195.623126 hartree
zpe.sumelectthermal: -1195.599603 hartree
zpe.sumelectthermalent: -1195.598658 hartree
zpe.sumelectthermalfe: -1195.676671 hartree
dipole: -0.3459 4.4789 1.0768
dipole: 4.6195
quadrupole: -136.5736 -132.4349 -130.3650
quadrupole: 4.0751 -2.6382 -16.1037
quadrupole: -3.4491 0.6896 2.7595 4.0751 -2.6382 -16.1037
hfenergy: -1195.9361159 hartree
pointgroup: C01 [X(C15H17N3O6)]
dipole: -0.6869357 1.6654015 0.2400904 debye
polarizability: 258.0884276|23.3404689|267.2532797|-7.4825798|4.4269912|135.2856321 unknown
InChI: InChI=1S/C15H17N3O6/c1-5-11(19)10-8(13(21)14(5)23-2)6(4-24-15(17)22)9-12(20)7(16)3-18(9)10/h7,12,20H,3-4,16-17H2,1-2H3
charge 0 multiplicity 1
41 atoms
O  -3.316311 -1.895616 -0.860532
O  -2.217036 2.290366 -0.209433
O  2.616075 -2.50203 -0.871559
O  3.863639 2.043584 -0.135004
O  1.115871 2.600438 0.703093
O  -3.886943 0.753235 -0.84834
N  -0.190766 -1.796561 -0.082202
N  -1.664727 -4.043963 1.680954
N  -3.476347 2.716263 -2.046058
C  -1.849485 -3.432089 0.360839
C  -1.311185 -1.075255 0.328887
C  -2.512527 -1.993523 0.358781
C  -0.46822 -3.228488 -0.340041
C  -0.935074 0.270809 0.519191
C  0.904824 -0.963561 -0.170455
C  0.476622 0.331043 0.209049
C  -1.820556 1.400744 0.945043
C  2.280664 -1.310383 -0.537852
C  1.432671 1.434101 0.289054
C  3.252775 -0.188462 -0.503955
C  2.853206 1.091738 -0.129987
C  4.683663 -0.476322 -0.885347
C  -3.243839 1.828186 -1.025702
C  3.64882 3.487326 0.115141
H  -2.500614 -4.084643 -0.242765
H  -3.141142 -1.851051 1.260572
H  0.317086 -3.869752 0.085883
H  -0.52294 -3.401297 -1.427867
H  -1.286893 2.1084 1.594907
H  -2.745398 1.032917 1.421398
H  -2.519575 -4.387001 2.124863
H  -1.056777 -3.530641 2.325848
H  -3.638893 -0.946936 -0.946158
H  5.009695 0.171299 -1.719698
H  4.784324 -1.533144 -1.178505
H  5.368632 -0.265898 -0.042972
H  3.327028 3.66563 1.152521
H  2.894054 3.903467 -0.571376
H  4.640019 3.927642 -0.075665
H  -4.208543 2.508316 -2.719492
H  -2.918375 3.563412 -2.125559
