program: Gaussian 09
title: 000208569
version: EM64L-G09RevD.01
frameworkgroup: C1[X(C17H21N3O)]
method: RPBEPBE
basis: SDD
operation: Freq
keyword: #p
keyword: freq=noraman
keyword: PBEPBE/SDD
title: #p freq=noraman PBEPBE/SDD
converged: YES YES NO NO
title: Mulliken charges:
elementType: O N N N C C C C C C C C C C C C C C C C C H H H H H H H H H H H H H H H H H H H H H
charge: -0.270085 -0.115708 -0.353381 -0.078888 -0.330942 -0.397196 -0.314396 -0.419753 -0.679763 -0.049432 0.151225 -0.002170 0.412562 -0.056464 -0.275419 -0.311472 -0.386671 -0.327221 -0.581458 -0.244678 -0.220445 0.249173 0.182888 0.260200 0.215746 0.203399 0.186032 0.192162 0.210510 0.331468 0.210369 0.230337 0.208401 0.240802 0.283043 0.247395 0.237827 0.259538 0.218832 0.216008 0.233100 0.234527
chargesum: 0.00000
title: Mulliken charges with hydrogens summed into heavy atoms:
elementType: O N N N C C C C C C C C C C C C C C C C C
charge: -0.270085 -0.115708 -0.021914 -0.078888 0.101120 0.078749 0.075035 -0.017081 -0.030657 0.191370 0.151225 -0.002170 0.412562 -0.056464 0.007624 -0.064078 -0.148844 -0.067683 -0.146618 -0.011578 0.014083
polarizability: 2.95248308e+02 -1.07872004e+01 2.24426486e+02 2.63525913e+01 -1.27305664e+01 1.36255958e+02
1716.lowfreq: -4.8491 0.0004 0.0004 0.0008 0.1553 6.2610 10.9182 17.2959 28.9213
frequency: 10.3177 17.2860 28.8694 49.9169 56.1678 70.3522 73.4239 85.0784 95.4493 127.1818 153.6904 182.5538 210.1549 230.5431 247.4192 253.3968 273.3233 302.9514 337.8953 381.0416 391.3517 399.8751 404.0807 451.5884 473.8360 482.0349 502.7496 516.0409 542.4740 587.3768 621.4721 624.7964 631.3577 724.1986 735.0435 739.7053 756.8059 776.7421 787.5845 796.6286 803.9549 824.1665 863.1156 879.8147 893.1191 909.8666 932.5334 936.6772 951.1706 968.2187 983.5865 997.5288 1006.1778 1010.7037 1015.6761 1019.5670 1043.1810 1065.6898 1075.4957 1094.3611 1106.9202 1138.7759 1144.1033 1157.7294 1166.3974 1172.0357 1183.1274 1227.6500 1243.0231 1248.0876 1258.3606 1273.5575 1282.4231 1284.8872 1296.6783 1298.8841 1329.7631 1346.1330 1360.9805 1365.2052 1378.7351 1388.7050 1406.2198 1421.7482 1425.7353 1454.0657 1455.2172 1459.1604 1467.3414 1473.4245 1476.6406 1488.4430 1498.9144 1510.9060 1551.0381 1590.2283 1613.6879 1624.3608 1657.5035 2847.2909 2855.2931 2871.3484 2983.9918 3002.8489 3005.0772 3025.3992 3053.6365 3075.4515 3084.3006 3091.5403 3092.0731 3108.3852 3124.5226 3135.4271 3139.0078 3155.7519 3170.3245 3179.9187 3195.6989 3468.5451
redmass: 4.8229 4.5550 4.0032 2.6113 3.8983 3.0563 2.9709 2.9743 4.4643 3.2075 1.7861 4.1732 3.1751 1.8138 3.3006 2.3770 4.4191 2.9747 7.3501 3.1819 2.7400 3.4420 2.9240 2.5364 3.3028 3.0186 3.9114 6.0796 3.5625 6.8264 3.6089 2.4195 3.6488 1.2043 2.1411 1.7427 5.2753 1.7285 1.8202 1.5036 3.2384 2.0250 1.5304 4.7271 1.7015 1.6257 2.3674 2.7773 1.4029 1.3690 2.1767 1.3314 1.3523 1.5663 2.0234 2.4076 3.3807 2.6011 1.7815 2.2690 1.6988 1.2383 1.8716 2.2767 1.3556 1.7347 1.9319 1.8015 1.5131 1.5518 1.4911 1.2369 1.2864 2.4210 2.2231 1.2167 1.2827 1.3695 3.7681 1.3367 1.3447 1.2323 4.9848 2.2930 1.2053 1.0922 2.9976 1.0807 1.0539 1.0716 1.0825 1.0673 2.5321 2.8904 7.5482 6.5322 8.7775 6.5644 4.7460 1.0721 1.0708 1.0707 1.0361 1.0653 1.0852 1.0869 1.0877 1.0984 1.0603 1.1003 1.1004 1.0942 1.0872 1.0907 1.0890 1.0947 1.1001 1.0959 1.1138 1.0771
irintensity: 0.4272 0.2298 0.3073 0.9791 1.0501 1.8518 3.0493 0.7510 0.8080 6.3607 1.0902 5.5105 0.7709 0.2294 1.2096 1.0534 1.5019 3.5110 9.3451 8.0342 21.5854 3.4338 2.7797 11.0313 5.4093 7.3184 5.0728 0.5996 15.2400 0.5529 5.5696 1.7658 0.9164 73.8041 0.3504 19.7306 4.2058 93.4230 6.7512 6.3578 3.0902 2.9011 41.0803 5.2847 12.5627 4.1422 12.9086 4.8549 83.9270 5.3253 17.5837 0.0806 0.0213 5.8346 2.5801 23.7092 12.3190 55.9062 13.3813 13.8890 21.2819 1.3206 6.0882 39.6452 22.0885 19.7628 15.4910 5.9986 21.6137 9.5240 2.2953 1.6163 15.5591 8.0467 9.1252 26.1752 1.8638 2.8545 5.2626 2.9140 2.5196 26.2743 5.6113 34.0824 13.1291 17.3797 0.8292 1.4405 8.3042 3.3421 8.0233 8.6376 317.3970 78.4459 23.2491 10.6838 157.9419 1.5942 8.3242 45.6281 84.1224 157.5523 32.8768 40.6598 38.3827 24.5718 10.9532 58.7783 11.3048 10.0302 37.2502 7.5598 2.8721 8.7023 11.0615 23.2977 24.3986 4.0898 24.5985 57.3462
temp: 298.150 k
press: 1.00000 atm
elementType: 8 7 7 7 6 6 6 6 6 6 6 6 6 6 6 6 6 6 6 6 6 1 1 1 1 1 1 1 1 1 1 1 1 1 1 1 1 1 1 1 1 1
symmnumber: 1
zpe: 910956.2 jmol-1
zpe.correction: 0.346965 hartree
zpe.thermalcorrener: 0.367596 hartree
zpe.thermalcorrenthalpy: 0.368540 hartree
zpe.thermalcorrgfe: 0.293574 hartree
zpe.sumelectzpe: -898.328648 hartree
zpe.sumelectthermal: -898.308017 hartree
zpe.sumelectthermalent: -898.307073 hartree
zpe.sumelectthermalfe: -898.382038 hartree
dipole: 2.6250 -2.8976 1.8487
dipole: 4.3249
quadrupole: -98.5560 -119.3433 -129.2208
quadrupole: 7.9024 0.2472 0.9238
quadrupole: 17.1507 -3.6366 -13.5141 7.9024 0.2472 0.9238
hfenergy: -898.6756125 hartree
pointgroup: C01 [X(C17H21N3O1)]
dipole: 1.039158 -1.1677796 0.6720539 debye
polarizability: 295.8019807|-11.9670663|225.2862494|24.0415783|-9.2910999|134.8425213 unknown
InChI: InChI=1S/C17H21N3O/c1-3-12-20(4-2)13-11-18-17(21)16-10-9-14-7-5-6-8-15(14)19-16/h3,5-10,18H,1,4,11-13H2,2H3
charge 0 multiplicity 1
42 atoms
O  -0.514007 2.016074 -1.172658
N  -4.399392 -0.61156 0.085875
N  -0.697955 -0.283664 -0.734995
N  1.928636 -0.460563 -0.17292
C  -2.957045 -0.392271 0.349129
C  -2.141233 -0.386846 -0.971153
C  -4.747201 -2.048283 -0.074386
C  -5.28926 0.097714 1.043195
C  -6.032637 -2.28004 -0.89157
C  -5.185943 1.603738 0.91509
C  -0.003714 0.897598 -0.841516
C  1.475127 0.760877 -0.53167
C  4.200052 0.513929 0.030429
C  3.277853 -0.603344 0.110897
C  2.311095 1.91846 -0.634269
C  3.670224 1.790316 -0.353858
C  5.58269 0.298758 0.33461
C  3.769461 -1.892501 0.493035
C  -5.040174 2.46127 1.955624
C  6.036628 -0.969626 0.70461
C  5.12394 -2.071129 0.784193
H  -2.827628 0.591551 0.833131
H  -2.536752 -1.15945 1.046825
H  -2.451347 0.481462 -1.575461
H  -2.348243 -1.303984 -1.554263
H  -3.906775 -2.538366 -0.600161
H  -4.834449 -2.557509 0.92015
H  -5.101622 -0.205421 2.104654
H  -6.329519 -0.201139 0.80698
H  -0.137775 -1.095071 -0.447137
H  -6.926351 -1.867327 -0.389733
H  -5.944521 -1.799046 -1.881281
H  -6.20551 -3.362734 -1.036955
H  -5.249449 1.985669 -0.114028
H  1.845917 2.861988 -0.931126
H  4.342079 2.653641 -0.423015
H  6.279447 1.143386 0.2731
H  3.053961 -2.718904 0.546715
H  -4.99954 3.545511 1.8039
H  -4.956278 2.102238 2.989719
H  7.095243 -1.129147 0.936463
H  5.496565 -3.059056 1.075929
