program: Gaussian 09
title: 000016761
version: EM64L-G09RevD.01
frameworkgroup: C1[X(C10H8Cl2N4)]
method: RPBEPBE
basis: SDD
operation: Freq
keyword: #p
keyword: freq=noraman
keyword: PBEPBE/SDD
title: #p freq=noraman PBEPBE/SDD
converged: YES YES NO NO
title: Mulliken charges:
elementType: Cl Cl N N N N C C C C C C C C C C H H H H H H H H
charge: 0.033380 0.029786 -0.397169 -0.010895 -0.008443 0.114426 0.453238 0.452303 -0.320039 -0.444737 -0.386127 -0.367079 -0.805124 0.111800 -0.267670 -0.236916 0.312987 0.226201 0.235433 0.236070 0.344547 0.225735 0.229027 0.239266
chargesum: 0.00000
title: Mulliken charges with hydrogens summed into heavy atoms:
elementType: Cl Cl N N N N C C C C C C C C C C
charge: 0.033380 0.029786 -0.052622 -0.010895 -0.008443 0.114426 0.453238 0.452303 -0.007052 -0.218536 -0.150693 -0.131009 -0.111096 0.111800 -0.267670 -0.236916
polarizability: 2.92962508e+02 3.68733115e+00 1.73914718e+02 7.02990145e-01 -5.70145661e-02 6.29490558e+01
1716.lowfreq: -18.4009 -0.0013 0.0006 0.0007 3.3034 7.1700 7.6630 40.1506 45.9487
frequency: -18.3211 40.0443 45.8564 73.3382 123.1026 143.8661 169.2547 179.1363 199.5346 216.2506 268.4467 348.7277 349.9651 388.5050 410.7998 421.4944 441.2396 515.5614 537.7578 617.7141 629.9454 644.1845 678.2295 717.9607 727.2777 749.5806 788.8566 798.5074 826.0125 843.8393 856.5824 877.6873 950.0519 960.3776 989.8396 996.2034 1011.1840 1047.6999 1126.9031 1146.0672 1184.3319 1195.9295 1225.3100 1243.1779 1277.0117 1310.2631 1335.4858 1385.3519 1398.7762 1419.0808 1455.7756 1470.8725 1473.5377 1502.1772 1510.4508 1565.7408 1604.1818 1627.1788 2975.8049 3057.1455 3086.6830 3111.3433 3132.3172 3141.4021 3195.5623 3510.5542
redmass: 1.0167 5.9042 4.2672 7.7248 5.9520 11.6952 11.7250 16.1836 6.2584 5.7622 7.5221 3.1837 3.9544 16.0563 2.9657 10.8253 11.9163 2.5427 6.2119 11.8862 7.1368 4.4004 8.2199 2.9346 1.5635 5.7302 6.6578 7.8150 1.4749 6.8267 1.2752 13.1324 1.3513 6.8200 1.4333 1.3259 2.8502 1.5591 1.6582 3.0308 8.2186 1.1774 2.5521 3.6519 7.2095 1.7948 2.6175 6.4025 1.2214 3.2551 5.3853 1.1380 1.0546 2.2894 3.2933 6.1567 4.0973 6.3685 1.0389 1.0947 1.0998 1.0884 1.0912 1.0961 1.0943 1.0753
irintensity: 0.5901 0.0043 0.0061 0.2468 0.4877 0.2409 0.4594 0.8332 2.0503 2.1126 1.3858 1.6212 0.4357 7.4982 0.0586 4.2746 4.0490 31.7618 21.7954 0.1027 1.5895 5.9361 18.8706 6.7343 30.2051 45.8599 16.2413 79.2887 83.5829 40.3405 16.8576 6.6207 5.3830 37.4838 0.2318 3.9159 7.3114 22.5089 58.3453 39.1824 264.4620 6.7909 3.6226 39.2211 25.3804 176.5307 233.1937 90.8561 7.2776 2.1454 604.5426 3.5988 13.1963 522.0464 90.8279 698.1046 251.2320 6.5947 38.2074 22.1948 16.7860 14.9553 18.6494 17.3176 8.6271 55.3601
temp: 298.150 k
press: 1.00000 atm
elementType: 17 17 7 7 7 7 6 6 6 6 6 6 6 6 6 6 1 1 1 1 1 1 1 1
symmnumber: 1
zpe: 438150.4 jmol-1
zpe.correction: 0.166883 hartree
zpe.thermalcorrener: 0.180329 hartree
zpe.thermalcorrenthalpy: 0.181273 hartree
zpe.thermalcorrgfe: 0.124863 hartree
zpe.sumelectzpe: -1523.864336 hartree
zpe.sumelectthermal: -1523.850890 hartree
zpe.sumelectthermalent: -1523.849946 hartree
zpe.sumelectthermalfe: -1523.906355 hartree
dipole: 5.3743 -1.7483 0.0599
dipole: 5.6518
quadrupole: -104.1605 -102.6701 -108.5776
quadrupole: -0.6705 0.3529 -0.0449
quadrupole: 0.9755 2.4660 -3.4415 -0.6705 0.3529 -0.0449
hfenergy: -1524.0312184 hartree
pointgroup: C01 [X(C10H8Cl2N4)]
dipole: -2.1247389 -0.6424482 0.1307686 debye
dipolederiv: -0.8043639 0.3974109 -0.0547651 0.5052943 -0.3879618 0.0475643 -0.0736446 0.0497566 -0.0656984 -0.1434733 -0.0711383 0.0140298 -0.2705924 -0.8853247 0.1490657 0.0488696 0.145058 -0.0855106 -1.8510705 -0.1426269 0.0550453 -0.6032721 -0.3128929 0.0144183 0.1338057 0.0049696 -0.3049024 -1.4040551 -0.4111968 0.0966216 -1.0952358 -0.9925762 0.1702963 0.2163902 0.1577876 -0.1659732 -2.2077478 0.0149943 0.0371901 0.1187964 -0.5689673 0.0680701 0.0199743 0.0702789 -0.173663 -1.0574051 0.416857 -0.0537621 0.2275326 -1.5085254 0.2415854 -0.0215506 0.2374178 -0.1331553 1.0249541 -0.0929452 -0.0066639 -0.3487676 0.0524394 0.012186 0.0381787 0.0058555 0.0685712 0.4082745 -0.1280046 0.0312841 -0.1242026 -0.0520777 0.0003668 0.1282753 -0.0148074 -0.0340699 -0.1515765 -0.0103511 0.0040618 0.0659181 -0.0679497 -0.008561 -0.0192782 -0.0083832 -0.134586 -0.1535784 0.0294826 -0.0061552 -0.0048967 0.0684064 -0.0477683 -0.0090549 -0.0454659 -0.177414 -0.2544417 0.0288165 -0.0037177 -0.1753196 0.1352545 -0.0518816 0.0213362 -0.0530844 -0.1453256 -0.0714007 0.0471447 -0.0066826 0.3071501 0.0490946 -0.033061 -0.0581597 -0.0251704 -0.1478359 -0.1649222 0.0571752 -0.0171188 0.0472581 0.0635999 0.0010677 -0.1744389 0.0238387 0.0645664 2.5162097 0.2751401 -0.0934588 1.0786837 0.8350075 -0.1266461 -0.2307046 -0.1111483 0.2534854 2.3078275 -0.4053232 0.0278424 -0.3301287 1.4858337 -0.2392833 0.0155007 -0.2376907 0.1102783 1.6532881 0.0233709 -0.0346738 0.5271357 1.9766704 -0.3413788 -0.123208 -0.3316303 0.1338797 0.1789484 -0.0361366 0.0054 -0.0719181 0.0603132 0.0180715 0.0143597 0.0164558 0.1621436 0.0627505 0.0932112 -0.0127532 0.0718397 -0.0827273 0.0407646 -0.0059402 0.0411706 0.1590406 0.0508969 0.0480687 -0.002641 0.0797531 -0.0810109 0.0364651 -0.0058235 0.0323508 0.1399467 -0.0568479 -0.1032534 0.0237879 -0.10509 0.008912 0.0233719 0.0288475 0.0271106 0.145482 0.1689836 -0.0122822 0.0051223 0.0806032 0.2070665 0.0149757 -0.0114011 0.0170705 0.30283 -0.0363777 -0.0286643 0.056754 -0.0975998 0.0046684 0.1002678 0.1307292 0.0651746 0.0341384 0.0396921 -0.0159944 -0.0056242 0.0853839 -0.1132888 -0.07319 0.0523414 -0.0640237 0.0895532 -0.0545648 0.026245 -0.0591228 0.0316746 0.1060363 -0.0167671 -0.1154043 -0.0028911 -0.0957815 unknown
polarizability: 292.7562816|-6.0989084|170.8801913|-2.9357855|-18.5085047|66.189809 unknown
InChI: InChI=1S/C10H8Cl2N4/c1-6-2-4-7(5-3-6)13-10-15-8(11)14-9(12)16-10/h2-5,13H,1H3
charge 0 multiplicity 1
24 atoms
Cl 4.941308 -1.773913 0.177145
Cl 2.768732 3.075948 -0.62323
N  -0.015436 -1.102272 0.157375
N  1.303641 0.866905 -0.21014
N  2.291969 -1.336134 0.150692
N  3.71381 0.591498 -0.209592
C  -1.346619 -0.592251 0.099345
C  -4.080467 0.238498 0.021992
C  -1.666537 0.77231 -0.118165
C  -2.392569 -1.53585 0.280412
C  -3.020639 1.164777 -0.151539
C  -3.736813 -1.120787 0.242638
C  -5.531321 0.678497 -0.050134
C  1.195563 -0.487601 0.026349
C  3.478568 -0.732493 0.023655
C  2.569215 1.310634 -0.312015
H  -0.865868 1.500544 -0.253018
H  -2.154659 -2.593202 0.455081
H  -3.255844 2.222953 -0.317107
H  -4.530523 -1.862972 0.387535
H  0.077377 -2.109015 0.327727
H  -6.18145 0.03795 0.571356
H  -5.655597 1.722026 0.288386
H  -5.912341 0.623751 -1.088649
