program: Gaussian 09
title: 000208542
version: EM64L-G09RevD.01
frameworkgroup: C1[X(C12H19ClN2O2S)]
method: RPBEPBE
basis: SDD
operation: Freq
keyword: #p
keyword: freq=noraman
keyword: PBEPBE/SDD
title: #p freq=noraman PBEPBE/SDD
converged: YES YES NO NO
title: Mulliken charges:
elementType: Cl S O O N N C C C C C C C C C C C C H H H H H H H H H H H H H H H H H H H
charge: -0.030277 0.937715 -0.538419 -0.533341 -0.102254 -0.481170 -0.361843 -0.412909 -0.327620 -0.329271 -0.668951 -0.680997 -0.021860 -0.214628 -0.239786 -0.186302 -0.184203 -0.099635 0.258045 0.191372 0.244791 0.255553 0.193556 0.201747 0.193069 0.202573 0.308808 0.224679 0.210740 0.207170 0.218426 0.239920 0.205507 0.283759 0.298833 0.268299 0.268904
chargesum: 0.00000
title: Mulliken charges with hydrogens summed into heavy atoms:
elementType: Cl S O O N N C C C C C C C C C C C C
charge: -0.030277 0.937715 -0.538419 -0.533341 -0.102254 -0.172363 0.087575 0.087435 0.067683 0.066371 -0.026363 -0.017144 -0.021860 0.069131 0.059047 0.081997 0.084701 -0.099635
polarizability: 2.41934495e+02 -1.95607945e+01 1.71671948e+02 -7.51955569e+00 -1.41992558e+01 1.55382950e+02
1716.lowfreq: -8.2589 -4.1734 0.0019 0.0024 0.0024 3.2057 10.9927 23.0971 31.2734
frequency: -5.5137 23.0649 31.2310 41.4018 57.2689 70.6342 92.0788 100.5890 114.5222 133.9497 158.4581 186.1037 208.4572 218.3307 237.9330 252.8316 256.9858 282.3058 293.5544 301.9385 349.5735 360.5991 376.6041 388.6768 409.6218 433.4199 438.7134 456.5589 488.6428 507.9002 526.6086 611.6908 698.0256 705.7968 734.3669 756.9687 794.2723 796.9906 804.9841 809.7458 824.6879 840.1634 913.5427 928.7695 956.5327 976.2970 983.9694 990.3287 1001.7658 1043.0789 1048.2014 1065.6976 1066.4400 1076.8958 1078.8344 1085.9096 1103.0055 1117.6771 1163.5594 1173.2127 1210.7708 1230.4381 1274.0213 1280.4355 1286.9160 1290.9888 1303.8516 1347.8043 1360.8125 1367.2451 1378.7718 1379.3410 1382.5042 1388.2312 1395.7087 1434.7234 1450.2284 1462.5781 1464.5857 1470.3253 1479.5266 1486.9718 1490.9045 1493.0926 1569.1709 1595.6246 2854.4388 2860.4585 2872.4505 2981.0959 2983.7631 2995.2432 3014.7090 3030.8253 3057.9121 3073.9241 3076.7081 3077.2597 3087.5528 3091.4425 3157.3151 3162.4723 3178.5500 3182.2594 3347.8645
redmass: 6.4809 3.6073 3.7683 4.4439 4.5960 2.6768 4.4180 2.2127 6.0511 4.8030 1.7945 5.7162 7.4394 1.5285 1.9140 2.8063 4.4388 3.3778 2.5304 2.4015 4.1242 4.3969 9.1344 3.2908 2.9142 4.3185 4.3055 2.8983 5.2762 3.3967 3.2518 7.1226 5.5919 4.2054 1.5350 1.8216 10.2356 1.2012 1.1978 1.6161 1.3275 1.3556 1.9929 11.4012 1.3500 1.3642 6.3892 2.2504 3.3903 2.9629 2.5215 2.7286 2.5535 2.0635 2.4246 2.0053 1.3202 1.7216 1.4781 1.1297 2.2313 1.5735 1.1470 1.2320 1.1707 1.2058 1.2925 1.2071 1.3497 1.3402 2.5928 1.4152 10.9491 1.2345 1.2238 1.0745 2.1428 1.0549 1.0569 1.0616 1.0642 1.0605 1.0681 1.0668 6.1842 8.2300 1.0713 1.0715 1.0713 1.0356 1.0358 1.0642 1.0878 1.0880 1.0886 1.0996 1.0986 1.0983 1.1006 1.1005 1.0898 1.0894 1.0965 1.0978 1.0742
irintensity: 0.4644 0.1446 0.1701 0.9171 0.5039 0.3634 3.7262 0.2512 1.3629 0.8538 0.6423 2.0093 4.4436 0.6666 1.0627 2.1551 0.4491 6.7546 0.0994 6.0507 9.0039 6.3704 53.4387 41.7114 0.1420 14.4483 20.7290 8.5487 16.2841 58.9967 48.8180 0.2440 17.0632 6.1763 81.3209 12.9555 86.8091 1.3824 12.7972 150.5751 17.2573 36.7868 0.8867 75.3312 0.0058 1.0918 31.0304 4.4699 10.7751 8.1163 36.9693 52.4991 28.1168 11.6508 35.8325 2.8185 3.9168 18.6347 23.5663 7.3045 33.7388 15.8721 3.4591 2.0258 12.2904 18.5024 22.8709 5.3215 1.6534 2.4965 13.7399 5.0431 1.1314 24.5873 16.2931 8.3586 57.6605 3.7217 3.0826 2.0577 3.5154 8.5731 17.9017 14.3560 31.1049 2.4427 50.0410 58.0966 201.7704 25.8087 31.9165 10.7344 22.8661 27.7755 4.1512 12.0563 32.2918 68.4669 35.4621 48.0478 3.9218 0.8862 0.9704 2.8253 14.2639
temp: 298.150 k
press: 1.00000 atm
elementType: 17 16 8 8 7 7 6 6 6 6 6 6 6 6 6 6 6 6 1 1 1 1 1 1 1 1 1 1 1 1 1 1 1 1 1 1 1
symmnumber: 1
zpe: 773456.2 jmol-1
zpe.correction: 0.294594 hartree
zpe.thermalcorrener: 0.314512 hartree
zpe.thermalcorrenthalpy: 0.315456 hartree
zpe.thermalcorrgfe: 0.244334 hartree
zpe.sumelectzpe: -1585.144644 hartree
zpe.sumelectthermal: -1585.124726 hartree
zpe.sumelectthermalent: -1585.123782 hartree
zpe.sumelectthermalfe: -1585.194904 hartree
dipole: -1.4762 -2.5384 -2.2552
dipole: 3.7025
quadrupole: -113.6450 -136.6495 -122.0381
quadrupole: -0.8134 1.4018 -8.8973
quadrupole: 10.4659 -12.5386 2.0727 -0.8134 1.4018 -8.8973
hfenergy: -1585.4392377 hartree
pointgroup: C01 [X(C12H19Cl1N2O2S1)]
dipole: -0.4436604 -1.3773977 -0.1669056 debye
polarizability: 239.8056729|-10.0276604|148.9806294|19.0356539|-12.8068447|180.2030905 unknown
InChI: InChI=1S/C12H19ClN2O2S/c1-3-15(4-2)10-9-14-18(16,17)12-7-5-11(13)6-8-12/h5-8,14H,3-4,9-10H2,1-2H3
charge 0 multiplicity 1
37 atoms
Cl 5.6245 -1.07444 2.112352
S  0.522634 1.606167 -0.791172
O  -0.485132 2.055722 0.418792
O  1.043824 2.658449 -1.91936
N  -3.623647 -0.799052 -0.41944
N  -0.163543 0.180632 -1.787597
C  -2.630098 0.075908 -1.077586
C  -1.23393 -0.596293 -1.101833
C  -4.318534 -1.718346 -1.358234
C  -4.532974 -0.078585 0.511319
C  -4.799156 -3.019772 -0.687316
C  -3.822784 0.37355 1.801912
C  2.003135 0.796586 0.044732
C  3.140248 0.521136 -0.732696
C  1.920958 0.544618 1.423081
C  4.258136 -0.05683 -0.091907
C  3.041014 -0.035323 2.061209
C  4.18479 -0.328478 1.291279
H  -2.540398 1.023479 -0.519287
H  -2.929191 0.340923 -2.122855
H  -1.277717 -1.571981 -1.624711
H  -0.915363 -0.805309 -0.065413
H  -5.181817 -1.21262 -1.861238
H  -3.603447 -1.981445 -2.161271
H  -5.010452 0.802949 0.01395
H  -5.353176 -0.768789 0.780468
H  -0.479391 0.634163 -2.668662
H  -3.943051 -3.559064 -0.24569
H  -5.527612 -2.821496 0.119349
H  -5.291413 -3.677652 -1.427893
H  -3.419438 -0.503417 2.338508
H  -2.983758 1.061869 1.591935
H  -4.531916 0.901052 2.467003
H  3.161746 0.758649 -1.800397
H  1.017608 0.812834 1.980313
H  5.165641 -0.288837 -0.655785
H  3.022705 -0.249056 3.133244
