program: Gaussian 09
title: 000208506
version: EM64L-G09RevD.01
frameworkgroup: C1[X(C6H9ClNO5P)]
method: RPBEPBE
basis: SDD
operation: Freq
keyword: #p
keyword: freq=noraman
keyword: PBEPBE/SDD
title: #p freq=noraman PBEPBE/SDD
converged: YES YES NO NO
title: Mulliken charges:
elementType: Cl P O O O O O N C C C C C C H H H H H H H H H
charge: -0.000205 1.403275 -0.506867 -0.510164 -0.490415 -0.205525 -0.559264 -0.049465 0.322267 0.444091 -0.416823 -0.749124 -0.479825 -0.484952 0.254198 0.258474 0.258774 0.250506 0.246369 0.247628 0.246330 0.244729 0.275986
chargesum: 0.00000
title: Mulliken charges with hydrogens summed into heavy atoms:
elementType: Cl P O O O O O N C C C C C C
charge: -0.000205 1.403275 -0.506867 -0.510164 -0.490415 -0.205525 -0.559264 -0.049465 0.322267 0.444091 -0.416823 0.022323 0.264678 0.282092
polarizability: 1.52191417e+02 2.74992613e+00 1.31084994e+02 -6.58406504e+00 2.55443148e+00 8.27082932e+01
1716.lowfreq: -65.2639 -11.5632 -2.1664 -0.0009 -0.0006 -0.0003 8.5126 13.0084 30.3482
frequency: -65.2592 11.2697 30.1998 48.0159 70.3137 84.7069 111.5258 119.8689 133.6750 141.6912 164.2293 184.0092 226.5886 250.4909 258.2753 277.1113 308.5081 351.3736 386.7745 422.7901 457.1244 483.1669 531.2112 589.3797 612.2434 655.8262 695.3061 715.8581 767.8820 857.0436 920.3222 956.9386 965.2936 1035.9184 1038.7079 1079.9515 1083.9237 1115.5593 1119.5591 1130.5982 1133.2208 1204.1149 1378.6095 1404.3349 1424.9476 1426.0344 1430.1758 1455.8811 1458.6347 1461.0653 1465.8088 1471.7198 1474.3574 1605.8111 2996.2817 2996.6658 2999.7197 3080.2883 3103.9764 3113.9737 3115.0430 3140.6804 3141.5598
redmass: 1.0194 7.9927 6.8403 3.7053 4.2337 2.8515 1.1096 3.4427 1.6790 4.1782 2.7688 4.7343 4.5951 6.6512 7.6596 7.4923 7.8887 6.7106 9.4406 7.6552 12.2810 7.3530 12.0112 7.0098 8.7370 7.4316 9.7422 10.8412 12.6123 10.6144 2.6798 12.2041 11.5863 5.6022 1.4552 13.3556 4.9365 1.2465 1.2416 1.2651 1.2968 4.8043 6.3674 1.3053 1.3699 1.1256 3.3240 1.0434 1.0524 1.0501 1.1170 1.0551 1.0654 10.0293 1.0290 1.0370 1.0282 1.0981 1.1064 1.0991 1.1074 1.1041 1.1047
irintensity: 0.0805 1.5775 1.2898 6.9393 1.9145 9.8762 0.1545 5.2607 0.1391 3.3041 3.5970 0.2689 9.4090 3.0588 0.9092 5.3727 18.3527 12.0520 53.0441 22.0817 6.0772 25.2665 42.8728 0.6612 74.2531 131.6738 15.5229 89.9810 67.7839 30.7489 6.2896 179.6039 164.7526 52.5694 5.5010 118.1616 121.5684 1.5103 3.1581 2.4556 0.4755 0.4239 8.7995 4.1526 66.5743 2.9050 295.6899 20.4293 2.9569 15.5805 37.2551 11.0654 25.6550 43.8518 36.4499 6.5574 32.6919 6.3703 21.1882 3.2002 9.9761 11.4566 7.9805
temp: 298.150 k
press: 1.00000 atm
elementType: 17 15 8 8 8 8 8 7 6 6 6 6 6 6 1 1 1 1 1 1 1 1 1
symmnumber: 1
zpe: 405989.5 jmol-1
zpe.correction: 0.154633 hartree
zpe.thermalcorrener: 0.170866 hartree
zpe.thermalcorrenthalpy: 0.171811 hartree
zpe.thermalcorrgfe: 0.107708 hartree
zpe.sumelectzpe: -1465.014653 hartree
zpe.sumelectthermal: -1464.998419 hartree
zpe.sumelectthermalent: -1464.997475 hartree
zpe.sumelectthermalfe: -1465.061577 hartree
dipole: -1.7249 1.2073 -3.3090
dipole: 3.9221
quadrupole: -76.7506 -91.6946 -102.7240
quadrupole: 1.4502 -9.7393 -0.6981
quadrupole: 13.6391 -1.3048 -12.3343 1.4502 -9.7393 -0.6981
hfenergy: -1465.1692858 hartree
pointgroup: C01 [X(C6H9Cl1N1O5P1)]
dipole: 0.64145 -1.1238346 -0.8405724 debye
dipolederiv: -0.0466073 0.0156617 -0.0214459 0.011243 -0.3732243 0.2130858 -0.0137954 0.2305241 -0.1202138 2.7103605 0.2946961 -0.082998 -0.3062531 1.8939091 -0.3501999 -0.35575 0.1103794 1.717472 -2.0974185 -0.0194111 0.1374585 -0.0089576 -0.4660388 0.0409203 0.2223094 -0.0370707 -0.4512266 -0.7942242 -0.3637381 0.0582428 -0.4031352 -1.2219899 0.124381 -0.0074407 -0.0340469 -0.5366969 -0.6511129 0.0301529 -0.0812301 0.113078 -0.6565839 0.33104 -0.1198705 0.3650174 -1.1058638 -0.6460763 -0.0567093 0.0417097 -0.0803111 -0.3956953 0.1603888 -0.0613969 0.1551063 -0.2189458 -0.704878 -0.0623423 0.0094476 0.0499682 -0.5868444 0.0226923 0.1348644 -0.0534684 -0.6407964 -0.0565392 0.0830621 -0.0507427 -0.0491266 -0.2285766 0.0493455 0.0354213 0.073346 -0.2035587 1.7188006 -0.0712222 0.0521382 0.3843054 0.140579 -0.0722173 0.2423581 -0.0371003 0.1572549 0.6272833 0.1228758 0.0127751 0.1029202 0.2469963 -0.0765826 0.0406809 -0.0657464 0.1337621 -0.6456255 -0.0421663 -0.0027252 -0.0950271 0.5253997 -0.3651716 -0.0065269 -0.3992328 0.1028295 -0.1999532 0.0227941 -0.0553099 0.082792 0.0213095 0.0395473 -0.1236778 0.0231542 0.0236358 0.2272417 -0.0041417 -0.0223132 0.2885148 0.7312823 -0.0379494 -0.1850345 -0.2090222 0.2443205 0.2489628 0.0208016 -0.006993 0.0419916 0.1703326 0.0057174 0.1166596 -0.2752874 0.6812724 0.0165838 0.0259145 -0.0050081 0.0751623 -0.0235838 -0.066329 0.0216701 -0.0551356 0.1056749 0.0760615 -0.0318718 0.0125157 -0.084166 0.0171111 0.0700322 0.0519842 0.0780632 0.0909087 0.030484 -0.0010251 0.0020593 -0.0098033 0.129134 -0.0051097 -0.0511288 -0.0209714 -0.0611433 -0.0166961 0.1271016 0.0540908 0.0384391 -0.0289435 -0.0021506 0.0748797 0.0102719 0.0724959 -0.0268249 -0.0875228 -0.07033 -0.0991774 -0.0011161 -0.0030855 -0.0706918 -0.0134124 0.0807666 0.1184305 0.0144922 0.0092158 -0.0213282 0.0193363 -0.0207833 0.0701713 0.0681105 -0.1035673 0.083046 0.0738522 -0.0251111 0.0796582 -0.0449678 0.0587542 -0.0239901 0.0723412 0.0210395 0.0321413 -0.0694945 -0.0595008 -0.1079677 0.0188912 -0.0903718 -0.0366093 -0.00454 -0.012249 -0.0034397 -0.0217595 0.0940546 -0.0028194 0.1132834 -0.0259542 0.0449136 0.0187203 0.0228289 unknown
polarizability: 152.4078552|4.1493149|115.4948124|5.572507|-22.5522487|98.0820365 unknown
InChI: InChI=1S/C6H9ClNO5P/c1-4-5(7)6(8-12-4)13-14(9,10-2)11-3/h1-3H3
charge 0 multiplicity 1
23 atoms
Cl 1.844223 -2.256834 1.152074
P  -1.938283 0.218635 0.422051
O  -0.556781 -0.574073 -0.420106
O  -3.136591 -0.838819 -0.190061
O  -2.273236 1.653916 -0.416844
O  2.521978 1.150297 -0.82059
O  -1.764542 0.376329 1.982229
N  1.073098 1.047091 -1.03473
C  0.733277 -0.09634 -0.386842
C  2.964164 0.050965 -0.062134
C  1.864991 -0.740345 0.219772
C  4.417857 -0.015599 0.261368
C  -3.190274 -2.232992 0.32353
C  -2.213834 1.713586 -1.906324
H  4.857823 -0.966572 -0.087023
H  4.948674 0.819031 -0.224351
H  4.584126 0.049639 1.351466
H  -2.281595 -2.783286 0.02539
H  -4.079313 -2.666054 -0.156588
H  -3.306027 -2.236563 1.421278
H  -2.621704 2.707031 -2.141999
H  -2.837132 0.919441 -2.350339
H  -1.163901 1.637415 -2.234826
