program: Gaussian 09
title: 000208536
version: EM64L-G09RevD.01
frameworkgroup: C1[X(C14H24N2O3S)]
method: RPBEPBE
basis: SDD
operation: Freq
keyword: #p
keyword: freq=noraman
keyword: PBEPBE/SDD
title: #p freq=noraman PBEPBE/SDD
converged: YES YES NO NO
title: Mulliken charges:
elementType: S O O O N N C C C C C C C C C C C C C C H H H H H H H H H H H H H H H H H H H H H H H H
charge: 0.954408 -0.276714 -0.543152 -0.539662 -0.517003 -0.120153 -0.414546 -0.367790 -0.334037 -0.095796 -0.227384 -0.223089 -0.618611 -0.635681 0.393345 0.018631 -0.364368 -0.370931 -0.688486 -0.686537 0.206641 0.204362 0.238895 0.264552 0.184628 0.256225 0.313758 0.315194 0.288745 0.223945 0.191922 0.217404 0.192118 0.282295 0.203323 0.198171 0.248977 0.262445 0.206891 0.235925 0.228096 0.215875 0.244727 0.232443
chargesum: 0.00000
title: Mulliken charges with hydrogens summed into heavy atoms:
elementType: S O O O N N C C C C C C C C C C C C C C
charge: 0.954408 -0.276714 -0.543152 -0.539662 -0.203245 -0.120153 -0.003543 0.135657 0.106816 -0.095796 0.087811 0.065657 0.014659 0.042055 0.393345 0.216801 -0.115391 -0.108486 -0.017575 0.006508
polarizability: 2.62586600e+02 1.20848312e+01 2.07603013e+02 2.81774907e+00 -6.30348220e+00 1.55427443e+02
1716.lowfreq: -10.8947 -5.8005 -0.0019 -0.0018 -0.0017 9.6012 12.4190 33.2184 34.5105
frequency: 2.7193 33.0526 34.4179 54.6519 68.6904 83.7403 90.3371 101.9885 110.4165 135.6134 154.9740 160.2501 179.3816 187.4936 199.4693 213.3697 238.7345 248.0512 263.5262 265.3908 287.7709 313.0531 321.7934 338.7931 352.9812 378.1183 379.7022 403.1450 412.5586 418.9558 424.8423 441.3753 457.5909 474.1056 511.5802 527.6520 613.2565 623.8184 716.9593 722.7613 741.3807 751.5381 803.4355 812.4688 820.5010 842.9181 848.0032 851.7522 918.4469 927.2360 928.5041 943.0331 948.3052 953.7062 973.6172 986.0326 999.6400 1031.1477 1054.1807 1059.2144 1064.1540 1088.1575 1101.4165 1102.8137 1119.7431 1139.3072 1151.1995 1159.5597 1174.3061 1187.3946 1203.0424 1226.3922 1255.8481 1264.3906 1290.7482 1295.2152 1318.9678 1321.1429 1345.4854 1352.7760 1365.2989 1381.3553 1384.9039 1386.8421 1401.3358 1414.7312 1417.8431 1439.6961 1450.0978 1453.9061 1456.3849 1467.3436 1467.6597 1470.4105 1472.4103 1472.9023 1477.0875 1479.9670 1489.4624 1492.0552 1582.9218 1598.5315 2847.7362 2855.1125 2874.3440 2969.3030 2980.1873 2983.0028 2991.5926 2996.4189 3016.5355 3019.3078 3024.3910 3046.4960 3056.1224 3077.9148 3086.5299 3087.9476 3095.5711 3098.6218 3104.5625 3135.1442 3156.1647 3169.6790 3176.6919 3408.8767
redmass: 3.9237 3.7443 3.4065 3.7879 3.8152 3.2961 3.0989 5.0925 4.1269 6.2579 3.3970 4.1067 3.4641 1.0393 5.3770 1.4622 1.2481 1.8760 1.5844 2.4904 4.7603 3.4034 2.0925 4.7536 2.9836 3.6778 2.2493 2.7264 2.0851 3.0682 3.6146 2.8612 2.9692 3.6905 2.3663 2.9000 6.0952 6.0587 2.9067 2.3925 2.7023 3.6516 11.3183 2.0609 1.4907 1.5971 3.2154 2.2437 2.9842 2.1430 2.3988 1.3483 2.1983 1.3542 1.3469 4.5804 2.2231 1.5937 2.1797 2.2083 2.3016 1.3701 2.2304 1.6973 1.3252 1.4295 1.9940 1.6036 1.3797 1.8723 1.3488 3.1002 2.0305 1.7345 1.2149 1.2756 1.3034 1.1941 1.3763 1.3989 1.2540 4.6310 1.2868 1.2707 1.2515 3.8723 1.1488 1.1664 1.0776 1.0722 1.0499 1.0788 1.1508 1.2412 1.3647 1.0977 1.0805 1.0592 1.0512 1.0558 7.0556 6.6053 1.0694 1.0569 1.0556 1.0623 1.0843 1.0651 1.0359 1.0364 1.0771 1.0940 1.0755 1.0904 1.0955 1.1004 1.1002 1.0992 1.1003 1.0997 1.1005 1.0917 1.0889 1.0934 1.0970 1.0753
irintensity: 1.1880 0.0228 1.0087 0.3396 0.2302 0.8568 0.6741 1.4860 2.6325 1.5332 1.0880 3.5998 0.6776 0.0492 4.0038 3.1593 0.2438 1.3492 1.0132 5.6168 10.9680 8.0640 8.0136 11.5220 29.2246 3.0604 25.1577 45.0284 3.9290 8.6267 27.7846 11.1575 46.6355 30.2337 7.8628 47.1357 2.4241 5.2797 35.2142 108.5297 3.3493 23.0733 91.2666 13.0390 7.6458 56.1605 29.4317 1.4767 38.8948 75.0359 81.5660 0.7079 8.7849 1.4206 0.2356 0.5081 33.6809 8.4423 4.4723 54.9923 5.2657 5.0447 14.2833 81.0768 20.3189 6.5162 14.7106 16.1978 47.6816 133.0098 11.0787 232.1331 2.2590 7.0209 2.3081 5.0889 17.5002 7.2364 4.6872 4.2460 10.4467 9.2712 29.4693 1.5140 35.3752 7.6487 4.4571 10.3739 3.1610 6.6013 5.9634 17.5133 25.0939 31.2250 62.5408 26.3590 20.8908 12.2879 13.9173 18.7381 62.1596 89.4403 59.4008 107.9916 288.5306 31.5167 26.3343 46.8690 14.0856 22.8226 31.7432 13.7613 53.4461 10.1932 10.5205 30.1087 15.5122 16.1209 25.4364 33.6375 34.5841 18.7887 1.0537 13.5301 7.8242 14.8818
temp: 298.150 k
press: 1.00000 atm
elementType: 16 8 8 8 7 7 6 6 6 6 6 6 6 6 6 6 6 6 6 6 1 1 1 1 1 1 1 1 1 1 1 1 1 1 1 1 1 1 1 1 1 1 1 1
symmnumber: 1
zpe: 954533.9 jmol-1
zpe.correction: 0.363563 hartree
zpe.thermalcorrener: 0.386880 hartree
zpe.thermalcorrenthalpy: 0.387825 hartree
zpe.thermalcorrgfe: 0.308312 hartree
zpe.sumelectzpe: -1279.342413 hartree
zpe.sumelectthermal: -1279.319095 hartree
zpe.sumelectthermalent: -1279.318151 hartree
zpe.sumelectthermalfe: -1279.397664 hartree
dipole: 2.9312 5.8268 3.1227
dipole: 7.2315
quadrupole: -110.0574 -134.3001 -134.4322
quadrupole: -1.1269 -11.3028 -6.2902
quadrupole: 16.2058 -8.0369 -8.1689 -1.1269 -11.3028 -6.2902
hfenergy: -1279.7059757 hartree
pointgroup: C01 [X(C14H24N2O3S1)]
dipole: 0.6380852 2.7693259 0.1348009 debye
polarizability: 254.7570847|21.7503295|201.8561797|-6.8671669|-25.9424008|169.0037915 unknown
InChI: InChI=1S/C14H24N2O3S/c1-12(2)19-13-6-8-14(9-7-13)20(17,18)15-10-5-11-16(3)4/h6-9,12,15H,5,10-11H2,1-4H3
charge 0 multiplicity 1
44 atoms
S  -1.453165 -2.171326 0.651893
O  3.862025 0.686522 0.351226
O  -2.280465 -1.906404 -0.73469
O  -1.164788 -3.705444 1.111974
N  -2.202703 -1.419886 2.166907
N  -3.220017 1.351498 -0.482035
C  -3.972788 0.43087 1.756417
C  -2.552967 0.020716 2.213308
C  -4.17407 0.454628 0.225381
C  0.159383 -1.230238 0.552429
C  0.210947 -0.040865 -0.190545
C  1.278585 -1.784154 1.20245
C  -3.470115 2.784656 -0.216914
C  -3.200311 1.063449 -1.93721
C  2.595572 0.10283 0.35796
C  4.109601 1.926848 -0.447459
C  1.446583 0.635506 -0.288816
C  2.505465 -1.108421 1.098265
C  5.38517 2.528118 0.149365
C  4.247691 1.572576 -1.937959
H  -4.723187 -0.255911 2.199058
H  -4.186632 1.430687 2.184905
H  -2.402056 0.315572 3.271669
H  -1.808661 0.579329 1.617508
H  -5.234867 0.744883 0.009306
H  -4.017865 -0.561837 -0.177613
H  -2.942061 -2.07404 2.477239
H  -0.691957 0.355621 -0.669586
H  1.184775 -2.72493 1.753982
H  -3.373373 3.004845 0.860523
H  -4.487559 3.117779 -0.546258
H  -2.721947 3.395841 -0.753356
H  -4.18244 1.262538 -2.434464
H  -2.9361 0.003168 -2.089193
H  -2.438896 1.694586 -2.432443
H  3.259231 2.620743 -0.284034
H  1.495848 1.563647 -0.863968
H  3.408406 -1.494078 1.579905
H  5.64472 3.465545 -0.374398
H  5.248495 2.748573 1.221508
H  6.227247 1.822135 0.044007
H  4.41809 2.488894 -2.532152
H  3.345772 1.071617 -2.329372
H  5.108187 0.897012 -2.086521
