program: Gaussian 09
title: 000016758
version: EM64L-G09RevD.01
frameworkgroup: C1[X(C12H22N4O2)]
method: RPBEPBE
basis: SDD
operation: Freq
keyword: #p
keyword: freq=noraman
keyword: PBEPBE/SDD
title: #p freq=noraman PBEPBE/SDD
converged: YES YES NO NO
title: Mulliken charges:
elementType: O O N N N N C C C C C C C C C C C C H H H H H H H H H H H H H H H H H H H H H H
charge: -0.274946 -0.274935 -0.247457 -0.247427 -0.340662 -0.340609 -0.420556 -0.408105 -0.408036 -0.420619 -0.371430 -0.371389 -0.360577 -0.360749 0.208818 0.208804 -0.407484 -0.407501 0.258762 0.243076 0.267448 0.242775 0.242767 0.267467 0.258717 0.243088 0.205935 0.184688 0.205947 0.184664 0.226084 0.198065 0.198106 0.226223 0.252686 0.212725 0.212697 0.252640 0.330164 0.330136
chargesum: 0.00000
title: Mulliken charges with hydrogens summed into heavy atoms:
elementType: O O N N N N C C C C C C C C C C C C
charge: -0.274946 -0.274935 -0.247457 -0.247427 -0.010499 -0.010472 0.081282 0.102118 0.102198 0.081186 0.019193 0.019223 0.063572 0.063579 0.208818 0.208804 0.057927 0.057836
polarizability: 1.77846745e+02 -2.30006102e-02 1.76671203e+02 -2.26552239e-01 4.48581853e-03 1.36907009e+02
1716.lowfreq: -14.0640 -0.0002 0.0005 0.0006 1.4965 3.9405 11.5188 18.1768 20.8934
frequency: 11.4157 18.1436 20.6670 26.9129 30.9223 36.6009 40.6187 78.1176 83.7324 110.1192 131.6264 133.0540 162.4641 213.9773 232.5570 256.4917 275.6165 298.8025 325.7431 332.0518 348.3139 422.6243 438.7767 504.7035 537.3848 591.9016 592.4135 627.7123 631.1018 711.0715 711.0900 723.4496 744.2510 750.9070 769.3244 772.6090 773.5873 814.9430 818.5931 831.9541 875.1201 888.7372 915.4056 918.7077 966.5569 990.9692 994.9848 995.8375 1054.3685 1060.0044 1069.1993 1069.6472 1094.7727 1095.1212 1107.8148 1109.7304 1110.0207 1120.8930 1128.6349 1129.1815 1153.6054 1160.1666 1160.2491 1185.7117 1191.7369 1223.9408 1240.8179 1250.3638 1251.2803 1266.9568 1285.6211 1287.8160 1294.1844 1319.7957 1345.9978 1349.0404 1366.7354 1368.8402 1436.8758 1436.9101 1450.3166 1450.3588 1452.5214 1453.5148 1454.3572 1458.3553 1465.4507 1479.3193 1483.3991 1483.9096 1635.0534 1635.7366 2948.4752 2954.1349 2974.1113 2974.9855 2991.5013 2992.9049 2993.8323 3014.3280 3041.2432 3049.2777 3073.3130 3073.4028 3083.2158 3083.2527 3089.6855 3089.7294 3191.9923 3192.0025 3209.9581 3209.9686 3562.5443 3562.6422
redmass: 5.3766 5.1828 5.7681 4.5870 4.6121 3.4661 3.0081 3.7609 1.7514 3.9335 2.9792 2.2553 4.6630 2.9195 2.7763 2.9669 3.9137 4.9052 2.6982 3.4126 3.5898 3.6995 3.0343 2.9205 2.2570 3.7028 3.8340 1.1360 1.1365 7.4150 6.6178 1.2350 2.3015 2.2496 1.8609 7.2016 4.5698 1.2144 1.1650 1.8976 2.4193 3.3913 2.2724 2.5554 2.3974 1.6901 1.1051 1.2068 3.2085 2.6768 1.2392 1.2425 2.5313 3.1388 2.9901 1.2870 1.3278 1.9597 1.5270 1.5778 1.4231 1.3819 1.3839 1.8190 2.1267 1.4595 1.3305 2.9650 3.0225 1.3747 1.1824 1.0536 1.2192 1.2525 1.4616 1.5596 1.3006 1.3495 1.0826 1.0827 1.2247 1.2277 1.1137 1.1168 1.0926 1.0747 1.0934 1.3804 1.3715 1.8289 8.3972 8.5193 1.0587 1.0603 1.0614 1.0627 1.0830 1.0657 1.0748 1.0997 1.1005 1.1017 1.1008 1.1008 1.0478 1.0478 1.0598 1.0598 1.1188 1.1188 1.1185 1.1185 1.0772 1.0773
irintensity: 0.0028 2.1851 10.1288 11.0038 0.9969 0.0975 1.5954 0.1825 0.0180 1.3119 0.0632 0.1742 0.2098 10.5375 5.0723 3.1613 4.5653 12.4020 16.5835 1.7582 0.4817 1.5939 3.0197 0.8835 0.5769 0.4401 13.5329 222.6735 26.5254 6.0850 0.0694 19.2757 18.2874 2.6615 1.4559 1.9259 28.6807 9.8784 16.8701 0.2988 17.4964 3.9425 1.0099 111.6152 60.4681 24.3643 0.0734 7.0010 22.6125 6.1381 9.4631 1.3038 17.5503 4.7850 1.9263 20.9030 1.6097 17.8826 4.1302 7.6422 1.1226 0.4332 0.4123 51.5523 69.4537 11.8644 3.6261 87.8894 72.7761 119.9994 4.0739 2.1876 38.3716 34.3286 1.4834 0.3290 6.8509 0.1037 9.4140 6.4350 23.9463 21.3159 69.5850 4.8421 15.8957 3.4176 5.2359 116.1639 62.9792 376.9032 370.7238 86.6148 2.4841 37.1162 5.3832 76.6378 3.4880 67.5113 15.1137 1.7725 0.2050 156.7130 18.7714 5.2235 35.5303 6.0894 8.9150 32.3246 2.2796 1.5863 9.1892 18.2480 19.1508 44.2827
temp: 298.150 k
press: 1.00000 atm
elementType: 8 8 7 7 7 7 6 6 6 6 6 6 6 6 6 6 6 6 1 1 1 1 1 1 1 1 1 1 1 1 1 1 1 1 1 1 1 1 1 1
symmnumber: 1
zpe: 888032.8 jmol-1
zpe.correction: 0.338234 hartree
zpe.thermalcorrener: 0.358613 hartree
zpe.thermalcorrenthalpy: 0.359557 hartree
zpe.thermalcorrgfe: 0.282302 hartree
zpe.sumelectzpe: -838.435916 hartree
zpe.sumelectthermal: -838.415537 hartree
zpe.sumelectthermalent: -838.414593 hartree
zpe.sumelectthermalfe: -838.491848 hartree
dipole: 0.0110 -1.6990 -0.0010
dipole: 1.6991
quadrupole: -113.7081 -94.1148 -116.7950
quadrupole: -0.0268 -20.3440 -0.0106
quadrupole: -5.5022 14.0912 -8.5890 -0.0268 -20.3440 -0.0106
hfenergy: -838.77415 hartree
pointgroup: C01 [X(C12H22N4O2)]
dipole: -0.003273 -0.6684577 -0.0014298 debye
polarizability: 177.8419089|0.0262037|176.6709984|-0.4960959|0.1056769|136.9120498 unknown
InChI: InChI=1S/C12H22N4O2/c17-11(15-7-8-15)13-5-3-1-2-4-6-14-12(18)16-9-10-16/h13-14H,1-10H2
charge 0 multiplicity 1
40 atoms
O  4.602348 0.390049 1.415649
O  -4.598563 0.386775 -1.412817
N  4.531389 1.301314 -0.843425
N  -4.536109 1.282102 0.852889
N  3.638861 -0.791904 -0.363167
N  -3.638877 -0.806329 0.36051
C  5.936457 1.910327 -0.770349
C  4.74782 2.704193 -0.290004
C  -4.755642 2.688079 0.308724
C  -5.94292 1.887415 0.781076
C  0.732928 -1.921076 -0.255502
C  -0.729034 -1.926197 0.245814
C  1.763078 -1.92004 0.895848
C  -1.759218 -1.920027 -0.905498
C  4.279103 0.286361 0.195171
C  -4.278394 0.275239 -0.192212
C  3.235041 -1.969722 0.420556
C  -3.231038 -1.977807 -0.430633
H  6.604548 1.508165 -0.000033
H  6.383736 2.113358 -1.747484
H  4.636476 2.820529 0.793818
H  4.322308 3.492963 -0.916735
H  -4.333805 3.473772 0.941774
H  -4.642326 2.812153 -0.774033
H  -6.608263 1.488604 0.006648
H  -6.392809 2.082326 1.758667
H  0.889363 -1.028734 -0.89578
H  0.90075 -2.809642 -0.900951
H  -0.889249 -1.039837 0.893426
H  -0.893115 -2.820746 0.883912
H  1.624537 -1.020902 1.527063
H  1.586251 -2.799625 1.548422
H  -1.579594 -2.794211 -1.56453
H  -1.623585 -1.015859 -1.530113
H  3.905691 -2.017379 1.296247
H  3.40377 -2.874754 -0.194993
H  -3.39676 -2.887227 0.179201
H  -3.901341 -2.022274 -1.306765
H  3.406731 -0.711639 -1.354511
H  -3.409545 -0.732795 1.353019
