program: Gaussian 09
title: 000208597
version: EM64L-G09RevD.01
frameworkgroup: C1[X(C25H31N3)]
method: RPBEPBE
basis: SDD
operation: Freq
keyword: #pfreq=noraman
keyword: PBEPBE/SDD
title: #p freq=noraman PBEPBE/SDD
converged: NO YES NO NO
title: Mulliken charges:
elementType: N N N C C C C C C C C C C C C C C C C C C C C C C C C C H H H H H H H H H H H H H H H H H H H H H H H H H H H H H H H
charge: -0.038617 -0.395150 -0.160193 -0.061825 -0.064753 -0.461783 -0.241066 -0.445163 -0.447582 -0.221713 -0.457512 -0.460244 0.159733 -0.397630 -0.448487 -0.587816 0.421710 0.452703 -0.355339 -0.369232 -0.369816 -0.402161 -0.238118 -0.241630 -0.274252 -0.237291 -0.225398 -0.242730 0.196744 0.196684 0.197513 0.189956 0.187891 0.204381 0.199967 0.209163 0.203643 0.203644 0.192187 0.208298 0.212908 0.191325 0.296275 0.234971 0.222196 0.214287 0.279150 0.265496 0.223571 0.242818 0.227417 0.253903 0.225387 0.217384 0.216556 0.223534 0.224709 0.222829 0.226564
chargesum: 0.00000
title: Mulliken charges with hydrogens summed into heavy atoms:
elementType: N N N C C C C C C C C C C C C C C C C C C C C C C C C C
charge: -0.038617 -0.098875 -0.160193 0.134919 0.131931 -0.074315 -0.053175 -0.040815 -0.034776 -0.018069 -0.057027 -0.056010 0.159733 0.059537 0.044950 -0.098748 0.421710 0.452703 -0.112520 -0.141815 -0.115913 -0.176775 -0.020733 -0.025074 -0.050718 -0.012582 -0.002568 -0.016166
polarizability: 3.12705233e+02 -2.75333209e+01 2.92294758e+02 5.43888885e+00 9.40425415e+00 2.30231922e+02
1716.lowfreq: -15.1907 -9.4961 -6.1536 -0.0004 -0.0001 0.0003 9.5103 12.2935 17.1798
frequency: -3.1982 11.9029 17.1206 24.4912 37.7790 42.0907 64.6734 72.4275 96.3675 155.8900 173.1415 189.0667 198.5355 232.2469 254.4723 274.9183 281.9883 300.1723 321.5528 341.6096 359.5183 373.8730 388.1604 394.0533 401.1278 403.2042 418.5080 424.3730 454.3860 457.7375 467.7959 508.3560 522.6545 545.4967 559.8669 571.8293 613.2722 615.0129 625.9008 628.6737 682.0912 693.6010 696.2941 701.5446 727.4417 739.2866 751.5323 754.5248 762.7544 784.9971 788.2966 812.3946 814.8520 846.3402 854.6949 855.5298 866.7405 869.7297 891.0240 897.0481 910.0521 925.7993 929.8429 953.8494 954.3415 969.1660 972.7402 974.4583 977.0728 981.4261 987.0876 989.3062 994.0785 1004.8998 1024.9673 1026.4796 1042.2787 1063.2466 1075.4727 1079.0451 1083.6396 1087.9577 1091.2237 1102.8134 1115.7461 1117.3864 1124.3836 1134.3486 1168.6457 1170.5986 1176.3365 1179.6664 1182.2065 1200.6644 1204.7309 1212.8049 1233.6528 1235.1420 1253.0754 1264.4754 1279.8477 1280.9208 1283.3346 1293.9886 1297.6690 1304.5920 1312.8088 1329.6885 1334.9747 1339.0570 1340.9634 1343.6246 1352.4883 1356.3515 1360.7198 1362.8646 1366.3847 1373.9907 1377.5329 1381.4591 1387.2995 1388.7790 1434.5542 1438.1044 1445.1412 1446.5031 1450.0892 1457.6756 1458.8781 1464.5219 1473.8156 1481.9844 1488.8714 1492.1494 1512.4539 1574.8840 1594.4325 1614.4408 1620.7254 1625.8926 2947.6975 2952.0810 2959.0724 2959.7599 2962.7746 2964.0833 2974.7389 2979.6570 2985.6556 2992.2053 2995.3229 3004.0988 3015.7629 3020.1405 3020.9459 3023.1794 3028.2637 3030.5687 3060.9412 3081.9092 3104.3461 3119.3306 3123.8286 3126.2952 3135.6476 3148.6286 3152.6315 3159.8512 3162.4437 3169.7370 3592.0734
redmass: 4.6237 4.7008 4.1715 3.7820 4.4241 4.4598 4.4156 3.9935 4.7046 4.5514 4.5357 4.0015 2.6812 3.2829 2.5656 4.5420 2.5455 3.9583 2.6601 3.7782 2.9466 2.6421 2.4648 1.8520 1.2753 2.8067 3.0079 2.5017 2.5138 2.8571 2.9937 2.6926 2.5511 3.5739 3.9834 3.2491 6.2781 6.2045 4.0953 4.5735 4.3043 1.8900 5.1113 2.4631 2.0890 2.0163 1.9630 3.5552 2.6761 4.2214 3.4338 3.1689 1.2722 2.2367 1.6657 1.2604 1.6904 1.9436 1.9265 2.1882 1.5009 2.0793 2.0833 1.8867 1.5378 2.4554 1.8666 1.9622 1.4704 2.8718 5.5008 5.2546 1.5747 1.9518 2.2423 2.2756 2.0301 2.0889 1.6800 1.7292 2.3248 1.4979 1.7448 1.9484 2.0402 1.0488 1.8108 1.0606 1.3306 1.0597 1.5537 1.2245 1.1577 1.1956 1.9808 1.3733 1.4130 1.2299 1.5374 1.3968 1.7211 1.5377 1.2844 1.4301 1.9342 1.8799 1.9530 1.3231 1.3296 1.3522 1.3992 1.2558 1.3570 1.4421 1.4726 1.2980 1.5163 1.2725 2.1763 5.8016 1.5813 4.0177 1.1498 2.1603 1.0913 1.9655 1.0864 1.0928 1.0954 1.2738 1.0966 1.9710 1.6382 1.7762 1.5665 5.9478 6.1260 5.9867 5.9084 5.9389 1.0657 1.0718 1.0666 1.0655 1.0614 1.0610 1.0741 1.0661 1.0801 1.0816 1.0619 1.0830 1.1024 1.0974 1.0997 1.1008 1.1016 1.1005 1.1001 1.0975 1.0877 1.0846 1.0858 1.0889 1.0915 1.0946 1.0922 1.0937 1.1010 1.0988 1.0781
irintensity: 0.2583 0.0893 0.1279 0.6953 0.5571 2.6398 0.5362 0.1806 0.4601 1.6915 1.2657 0.7818 0.7355 13.4079 0.8719 0.5385 1.5240 2.0669 1.7965 0.6550 5.3995 6.6227 9.2942 2.8798 70.9544 0.6155 1.2201 18.2702 5.8312 21.5688 6.0837 11.7769 0.9960 1.2718 0.4847 0.0899 0.8010 0.3644 5.7660 5.3767 4.4088 35.6713 3.1869 22.4269 25.2917 51.2341 76.5924 9.3110 1.1071 0.2283 3.6314 1.4581 0.2237 4.2061 0.0751 0.3002 9.9777 3.5156 4.7609 4.3737 0.2420 2.4042 4.2156 8.5148 2.7424 3.7879 4.8228 0.6164 2.7083 28.1366 0.1980 0.1003 4.0602 9.2569 14.0886 16.9111 1.9085 0.1605 4.3741 5.4666 10.6988 1.1387 7.6106 4.8215 9.9002 0.7548 17.9549 0.1147 5.6239 0.5546 11.9020 1.2595 10.0086 5.8206 34.6599 42.8961 70.8840 15.3720 0.9321 5.2941 6.9237 1.2920 10.2262 25.3772 0.6389 7.3164 3.1432 0.1188 0.2930 1.0753 20.6224 20.1851 3.1791 1.9497 4.4840 47.8439 0.1595 3.3294 80.5866 6.2701 7.0608 3.8823 37.5780 15.9784 4.9395 4.7740 7.6058 17.5999 11.8777 26.0022 5.5652 15.9485 5.4497 268.4743 111.8340 9.9040 3.5045 34.7455 270.7658 111.6126 37.2392 9.2196 7.1815 17.1820 22.7679 3.3481 128.2615 20.1079 159.3306 124.0160 58.0061 66.2305 5.6466 4.2058 23.7316 73.9414 53.5835 76.9037 12.1571 15.8530 13.2595 9.1425 0.2439 13.9875 21.6846 35.2362 45.7088 34.2237 23.5174 3.2826 26.3179
temp: 298.150 k
press: 1.00000 atm
elementType: 7 7 7 6 6 6 6 6 6 6 6 6 6 6 6 6 6 6 6 6 6 6 6 6 6 6 6 6 1 1 1 1 1 1 1 1 1 1 1 1 1 1 1 1 1 1 1 1 1 1 1 1 1 1 1 1 1 1 1
symmnumber: 1
zpe: 1335440.4 jmol-1
zpe.correction: 0.508642 hartree
zpe.thermalcorrener: 0.531685 hartree
zpe.thermalcorrenthalpy: 0.532629 hartree
zpe.thermalcorrgfe: 0.453853 hartree
zpe.sumelectzpe: -1133.451880 hartree
zpe.sumelectthermal: -1133.428838 hartree
zpe.sumelectthermalent: -1133.427894 hartree
zpe.sumelectthermalfe: -1133.506670 hartree
dipole: -2.7193 -0.0648 1.5324
dipole: 3.1220
quadrupole: -168.7019 -160.0055 -163.4914
quadrupole: 2.0967 -5.9749 2.6764
quadrupole: -4.6356 4.0608 0.5748 2.0967 -5.9749 2.6764
hfenergy: -1133.9605224 hartree
pointgroup: C01 [X(C25H31N3)]
dipole: -1.0480002 -0.3137996 -0.5585098 debye
polarizability: 297.6748089|27.9121091|307.8133041|-11.72071|-1.6247169|229.743801 unknown
InChI: InChI=1S/C25H31N3/c1-3-7-19(8-4-1)18-28(24-9-5-2-6-10-24)12-11-26-25-22-14-20-13-21(15-22)17-23(16-20)27-25/h1-10,20-23,26H,11-18H2
charge 0 multiplicity 1
59 atoms
N  -2.400755 0.082504 1.279873
N  -1.549748 1.701071 -0.160773
N  1.399741 1.092234 0.234242
C  -3.529318 -2.370213 -0.635631
C  -5.345997 -0.73019 -0.005978
C  -5.062211 -2.133093 -0.603897
C  -3.191017 0.157397 -1.154415
C  -2.869564 -1.311634 -1.559985
C  -4.719584 0.352865 -0.92519
C  -3.314362 -1.046904 1.598934
C  -2.977648 -2.348884 0.814079
C  -4.819975 -0.677723 1.453488
C  -2.380359 0.605793 0.074246
C  -0.737354 2.32277 0.889562
C  0.488834 1.469692 1.327935
C  1.228395 -0.241463 -0.35814
C  2.325258 2.004795 -0.304004
C  2.289629 -1.284183 0.024736
C  3.201211 1.627013 -1.371707
C  2.435682 3.341588 0.197459
C  3.194911 -1.067998 1.089733
C  2.340198 -2.515058 -0.678325
C  4.12107 2.547105 -1.912756
C  3.367418 4.246507 -0.350215
C  4.216612 3.867471 -1.415118
C  4.130565 -2.064363 1.45115
C  3.271552 -3.513887 -0.318393
C  4.17125 -3.291782 0.750993
H  -3.322899 -3.370392 -1.068029
H  -6.441308 -0.558109 0.017661
H  -5.554238 -2.914379 0.009357
H  -5.48328 -2.206367 -1.627177
H  -2.897575 0.808789 -2.003629
H  -3.244532 -1.471197 -2.591892
H  -1.771244 -1.458251 -1.590104
H  -4.907054 1.364074 -0.514463
H  -5.224463 0.304827 -1.91208
H  -3.133755 -1.25757 2.670505
H  -3.414239 -3.208363 1.363503
H  -1.878571 -2.491003 0.81719
H  -4.979841 0.327772 1.889479
H  -5.412974 -1.392997 2.06004
H  -1.459147 2.046513 -1.114188
H  -1.371647 2.467784 1.785699
H  -0.411431 3.311482 0.520747
H  1.038477 2.022188 2.116143
H  0.095546 0.549753 1.790676
H  0.240314 -0.617165 -0.032985
H  1.177122 -0.165851 -1.464877
H  3.189383 0.604591 -1.759385
H  1.800609 3.679651 1.021443
H  3.16804 -0.111558 1.622861
H  1.647237 -2.693444 -1.511724
H  4.779056 2.220388 -2.726872
H  3.425475 5.261268 0.0617
H  4.935878 4.575961 -1.838669
H  4.828913 -1.880481 2.275689
H  3.299149 -4.460374 -0.870698
H  4.896967 -4.063867 1.030472
