program: Gaussian 09
title: 000208595
version: EM64L-G09RevD.01
frameworkgroup: C1[X(C12H18N4O2S)]
method: RPBEPBE
basis: SDD
operation: Freq
keyword: #p
keyword: freq=noraman
keyword: PBEPBE/SDD
title: #p freq=noraman PBEPBE/SDD
converged: YES YES NO NO
title: Mulliken charges:
elementType: S O O N N N N C C C C C C C C C C C C H H H H H H H H H H H H H H H H H H
charge: 0.136767 -0.291830 -0.272903 -0.195248 -0.156984 -0.325062 -0.059050 0.242541 0.120220 -0.209534 0.213675 -0.599984 -0.618840 -0.231960 -0.560503 0.581621 -0.814271 -0.745442 -0.834845 0.336077 0.363519 0.252520 0.269581 0.253603 0.282031 0.243947 0.242519 0.231795 0.214758 0.213635 0.237638 0.230817 0.222437 0.221915 0.269532 0.270646 0.264661
chargesum: 0.00000
title: Mulliken charges with hydrogens summed into heavy atoms:
elementType: S O O N N N N C C C C C C C C C C C C
charge: 0.136767 -0.291830 -0.272903 -0.195248 -0.156984 0.038457 -0.059050 0.242541 0.120220 0.126543 0.213675 0.175720 0.149657 -0.231960 -0.113950 0.581621 -0.132181 -0.301090 -0.030006
polarizability: 2.43261624e+02 -3.19962352e+00 2.28160243e+02 -9.75114577e+00 -1.16075041e+01 1.20952271e+02
1716.lowfreq: -11.7188 -6.7411 -1.4902 -0.0016 -0.0008 0.0010 21.7208 27.5599 38.5298
frequency: 21.4859 27.3555 38.5171 43.7953 50.6297 71.9516 77.8908 95.5640 101.7327 106.8083 120.7239 126.3405 148.0936 176.2087 197.1763 216.8338 232.2424 249.5801 272.5167 287.3601 310.6662 361.5307 388.7331 394.7437 398.3440 407.3222 451.4084 457.4840 480.1720 499.8818 526.4518 597.5015 599.2723 638.3770 644.2016 699.3045 705.0290 717.6609 746.1594 751.6903 803.2424 826.7724 901.6145 914.3745 944.9067 952.3923 966.9333 968.5632 975.9002 981.2347 990.5203 1031.1649 1058.3412 1061.3356 1080.4810 1128.1231 1131.9033 1149.7346 1202.6098 1225.8470 1241.1615 1265.8172 1296.1077 1304.5109 1330.6381 1342.9048 1349.4918 1379.4723 1387.2328 1428.2222 1430.4282 1432.9354 1446.0743 1451.7655 1458.4162 1463.0046 1473.3833 1476.0001 1478.1837 1478.9466 1489.8069 1507.5823 1566.5365 1621.9360 1637.2934 1664.6783 1674.4418 2919.0256 2963.0582 2999.1025 3012.9009 3015.2772 3026.8251 3039.8839 3088.2011 3088.7539 3089.1295 3107.9468 3133.1456 3135.5151 3137.0838 3143.5249 3178.8270 3190.8576 3461.1244
redmass: 3.5610 3.7532 4.1805 3.6013 3.6769 1.8149 1.5321 1.9269 1.1085 1.5331 3.6390 4.9831 3.4221 1.3674 2.8118 4.4039 5.4265 6.2229 4.8284 4.5417 3.0047 3.8309 3.4898 8.4056 2.9870 2.7340 4.2974 6.5412 5.2670 6.9326 3.2557 8.6038 5.6016 3.7124 7.1383 1.3011 10.7095 1.1125 10.4817 7.1292 3.7861 3.5373 3.5781 1.2895 1.5425 1.4066 1.7405 1.3458 3.5208 1.3084 2.3399 1.5175 2.3072 1.9137 2.1362 1.2967 1.3128 2.1571 2.6792 1.3814 3.6996 2.6828 2.5655 2.4105 1.3054 1.2189 2.6048 2.8485 1.2462 1.3634 1.1744 1.2676 1.0582 1.0743 1.0573 1.0638 1.0429 1.0895 1.0645 1.1144 1.0454 2.1727 8.1387 8.7583 9.4315 7.6119 5.2473 1.0647 1.0383 1.0344 1.0281 1.0328 1.0934 1.0951 1.0688 1.1031 1.0924 1.1022 1.0996 1.1056 1.1042 1.1026 1.0957 1.1139 1.0767
irintensity: 0.4227 0.7656 0.6363 1.5577 0.6096 0.1693 0.0836 1.4804 0.7601 0.4490 4.2668 8.2253 2.1539 1.9951 0.6849 1.7982 2.8566 3.4826 0.2164 5.9534 2.8242 9.2703 1.3408 33.4142 2.6989 0.9010 2.9046 30.6207 7.4552 20.3583 6.3096 0.5626 9.0442 6.6294 5.1673 1.0398 10.2844 74.0624 11.1965 8.3888 11.3972 9.8093 23.7202 30.0637 11.9941 73.6618 15.3443 2.1712 23.1281 9.5975 51.8767 18.3577 6.7371 2.2775 72.7123 0.7605 0.0403 32.3751 2.8479 9.8093 18.4767 1.8371 5.5394 26.0820 59.5783 5.5698 38.6586 223.6089 19.4453 282.8152 13.3142 102.2751 6.0998 20.5032 15.5984 5.6369 18.0509 119.6689 17.4101 71.4651 22.9771 158.1288 407.1154 630.4891 6.9270 192.5477 98.8636 52.7450 24.9009 44.1399 25.5341 23.5240 21.3855 21.8483 24.4167 19.1924 20.4580 14.8206 0.1599 13.0482 8.2832 0.8865 8.5182 22.4870 104.4223
temp: 298.150 k
press: 1.00000 atm
elementType: 16 8 8 7 7 7 7 6 6 6 6 6 6 6 6 6 6 6 6 1 1 1 1 1 1 1 1 1 1 1 1 1 1 1 1 1 1
symmnumber: 1
zpe: 768851.2 jmol-1
zpe.correction: 0.292840 hartree
zpe.thermalcorrener: 0.314626 hartree
zpe.thermalcorrenthalpy: 0.315570 hartree
zpe.thermalcorrgfe: 0.239286 hartree
zpe.sumelectzpe: -1234.154225 hartree
zpe.sumelectthermal: -1234.132439 hartree
zpe.sumelectthermalent: -1234.131494 hartree
zpe.sumelectthermalfe: -1234.207778 hartree
dipole: 2.2767 1.5612 1.4114
dipole: 3.1005
quadrupole: -130.4378 -119.9386 -118.2895
quadrupole: 1.7120 5.9244 -5.8166
quadrupole: -7.5492 2.9501 4.5991 1.7120 5.9244 -5.8166
hfenergy: -1234.4470645 hartree
pointgroup: C01 [X(C12H18N4O2S1)]
dipole: 0.9691284 0.5205968 0.5270051 debye
polarizability: 242.354678|-6.1039265|225.9461874|-7.4690504|-22.0810254|124.0732719 unknown
InChI: InChI=1S/C12H18N4O2S/c1-8(2)6-13-11(19-5)14-9-7-15(3)12(18)16(4)10(9)17/h7,14H,1,6H2,2-5H3
charge 0 multiplicity 1
37 atoms
S  2.441608 -2.957696 -0.256531
O  -2.410637 -2.297989 0.176394
O  -4.100526 2.080687 -0.141891
N  -3.260578 -0.103056 0.016384
N  -1.787208 1.728027 -0.398793
N  0.137246 -1.482832 -0.245829
N  2.030321 -0.137455 -0.658761
C  -0.867834 -0.499747 -0.239758
C  -2.209586 -1.051936 -0.000893
C  -0.698598 0.8554 -0.434724
C  -3.109866 1.295012 -0.173974
C  -4.643619 -0.580213 0.249256
C  -1.554516 3.172732 -0.615444
C  1.502178 -1.298144 -0.412342
C  3.481893 0.078474 -0.815214
C  4.005691 1.129329 0.163274
C  3.787851 0.83303 1.634046
C  4.657023 2.236787 -0.277724
C  2.354307 -3.148781 1.628498
H  0.293318 1.269774 -0.623414
H  -0.224651 -2.439909 -0.146073
H  -5.05857 -0.102191 1.15137
H  -4.598795 -1.671582 0.373772
H  -5.28157 -0.312512 -0.608543
H  -2.521591 3.688801 -0.52737
H  -1.136064 3.345127 -1.622145
H  -0.855863 3.563403 0.144142
H  3.664732 0.425083 -1.849697
H  4.041127 -0.874154 -0.669934
H  4.256633 -0.132104 1.913911
H  2.707443 0.74426 1.85723
H  4.213111 1.620983 2.278055
H  4.797644 2.434942 -1.347223
H  5.074449 2.973782 0.418169
H  1.307102 -3.203454 1.961759
H  2.872102 -2.31043 2.117652
H  2.868293 -4.094848 1.859062
